Ontología de incendios forestales del proyecto Cross-Forest.
type: Ontology
version IRI: https://datos.iepnb.es/def/sector-publico/medio-ambiente/incendios-forestales/1.1
creator: Tragsatec
date: 2021-06-03
description: An RDF/OWL vocabulary to represent spatial information on forest fires in Spain and Portugal within the european Cross-Forest project (INEA/CEF/ICT/A2017/156673). @en
description: Un vocabulario RDF/OWL para representar información espacial sobre incendios forestales de España y Portugal en el seno del proyecto europeo Cross-Forest (INEA/CEF/ICT/A2017/156673).
title: Forest fire ontology of the Cross-Forest project. @en
preferred namespace prefix: incendios-forestales
version info: 1.1
change note: 2021-06-03 - Cambiado dataProperty time:year a la subclase Año de prov:Collection, para agrupar los incendios por años. 2021-03-15 - Creación de la ontología OWL de incendios forestales.

Well-known Text Literal
type: Datatype
comment: A Well-known Text serialization of a geometry object. @en

conformsTo
type: ObjectProperty
range: Standard
comment: An established standard to which the described resource conforms. @en
comment: Norma establecida a la que se ajusta el recurso descrito.

language
type: ObjectProperty
domain: Dataset
range: LinguisticSystem
comment: Un lenguaje del recurso.

license
type: ObjectProperty
range: LicenseDocument
comment: A legal document under which the resource is made available. @en
comment: Documento legal en virtud del cual se pone a disposición el recurso.

provenance
type: ObjectProperty
range: ProvenanceStatement
comment: A statement of any changes in ownership and custody of the resource since its creation that are significant for its authenticity, integrity, and interpretation. @en
comment: Una declaración de cualquier cambio en la propiedad y custodia del recurso desde su creación que sea significativo para su autenticidad, integridad e interpretación.

publisher
type: ObjectProperty
range: Agent
comment: Algunos ejemplos de editor son una persona, una organización o un servicio. Normalmente, el nombre de un editor debe utilizarse para indicar la entidad.
comment: Examples of a Publisher include a person, an organization, or a service. Typically, the name of a Publisher should be used to indicate the entity. @en

rights
type: ObjectProperty
range: RightsStatement
comment: A statement that concerns all rights not addressed with dct:license or dcterms:accessRights, such as copyright statements. @en
comment: Una declaración que se refiere a todos los derechos no abordados con dct:license o dcterms:accessRights, como las declaraciones de derechos de autor.

spatial
type: ObjectProperty
domain: Dataset
range: Location
comment: Características espaciales del recurso.
comment: Spatial characteristics of the resource.

temporal
type: ObjectProperty
domain: Dataset
range: PeriodOfTime
comment: Características temporales del recurso.
comment: Temporal characteristics of the resource.

type
type: ObjectProperty
comment: La naturaleza o el género del recurso.
comment: The nature or genre of the resource.

contains
type: ObjectProperty
inverse of: está en el esquema
domain: Esquema conceptual
comment: El modelo SKOS define la propiedad skos:inScheme como un mecanismo para vincular un Concepto con uno o varios Esquemas Conceptuales. Sin embargo, SKOS no incluye una propiedad inversa que permita definir los elementos que contiene un esquema conceptual.
comment: The SKOS model define the skos:inScheme property as a mechanism to link a Concept with one or serveral Concept Schemes. However, SKOS does not include an inverse property that allows to define the elements that are contained by a Concept Scheme. @en

has quantity
type: ObjectProperty
range: Valor de la cantidad
label: tiene una cantidad

unit
type: ObjectProperty
comment: A reference to the unit of measure of a quantity (variable or constant) of interest. @en
comment: Referencia a la unidad de medida de una cantidad (variable o constante) de interés.
label: unidad

pertenece a provincia
type: ObjectProperty
sub property of: within
range: Provincia
comment: Provincia a la que pertenece un fenómeno geográfico o una entidad administrativa.
label: belongs to province @en

tiene geometría
type: ObjectProperty
domain: Incendio forestal
range: Geometry
comment: A spatial representation for a given feature. @en
comment: Una representación espacial para una característica determinada.
label: hasGeometry @en

contains
type: ObjectProperty
inverse of: within
range: AdministrativeArea
comment: Existe si el sujeto SpatialObject contiene espacialmente el objeto SpatialObject.
comment: Exists if the subject SpatialObject spatially contains the object SpatialObject. @en
label: contiene

within
type: ObjectProperty
domain: AdministrativeArea
comment: Existe si el sujeto SpatialObject está espacialmente dentro del objeto SpatialObject.
comment: Exists if the subject SpatialObject is spatially within the object SpatialObject. @en
label: dentro de

has exact match
type: ObjectProperty
type: SymmetricProperty
type: TransitiveProperty
domain: Collection
range: Dataset
label: tiene coincidencia exacta

está en el esquema
type: ObjectProperty
domain: Concepto
range: Esquema conceptual
label: is in scheme @en

tiene principio
type: ObjectProperty
domain: Intervalo temporal
range: Instante temporal
comment: Beginning of a temporal entity. @en
comment: Inicio de una entidad temporal.
label: has beginning @en

tiene fin
type: ObjectProperty
domain: Intervalo temporal
range: Instante temporal
comment: End of a temporal entity. @en
comment: Fin de una entidad temporal.
label: has end @en

accessURL
type: ObjectProperty
domain: Distribución
range: Resource
description: dcat:accessURL SHOULD be used for the URL of a service or location that can provide access to this distribution, typically through a Web form, query or API call. dcat:downloadURL is preferred for direct links to downloadable resources. If the distribution(s) are accessible only through a landing page (i.e. direct download URLs are not known), then the landing page URL associated with the dcat:Dataset SHOULD be duplicated as access URL on a distribution (see § 5.7 Dataset available only behind some Web page). @en
comment: A URL of the resource that gives access to a distribution of the dataset. E.g. landing page, feed, SPARQL endpoint. @en
comment: Una URL del recurso que da acceso a una distribución del conjunto de datos. Por ejemplo, página de aterrizaje, feed, punto final SPARQL.

contactPoint
type: ObjectProperty
range: Kind
comment: Información de contacto relevante para el recurso catalogado. Se recomienda el uso de vCard.
comment: Relevant contact information for the cataloged resource. Use of vCard is recommended. @en

dataset
type: ObjectProperty
sub property of: hasPart
domain: Catalog
range: Dataset
comment: Una colección de datos que aparece en el catálogo.
comment: A collection of data that is listed in the catalog.

distribution
type: ObjectProperty
domain: Dataset
range: Distribución
comment: Una distribución disponible del conjunto de datos.
comment: An available distribution of the dataset.

mediaType
type: ObjectProperty
domain: Distribución
range: MediaType
comment: El tipo de medio de la distribución definido por la IANA.
comment: The media type of the distribution as defined by IANA. @en
scope note: file-type
scope note: This property SHOULD be used when the media type of the distribution is defined in IANA https://www.w3.org/TR/vocab-dcat-2/#bib-iana-media-types, otherwise dct:format MAY be used with different values. @en

theme
type: ObjectProperty
range: Concepto
comment: Una categoría principal del recurso. Un recurso puede tener varios temas.
comment: A main category of the resource. A resource can have multiple themes.

hadDerivation
type: ObjectProperty
domain: Entity
range: Entity
comment: A derivation is a transformation of an entity into another, an update of an entity resulting in a new one, or the construction of a new entity based on a pre-existing entity. @en
comment: Una derivación es una transformación de una entidad en otra, una actualización de una entidad que da lugar a una nueva, o la construcción de una nueva entidad basada en una entidad preexistente.

hadMember
type: ObjectProperty
inverse of: es miembro de
domain: Collection
range: Incendio forestal
comment: A collection is an entity that provides a structure to some constituents, which are themselves entities. These constituents are said to be member of the collections. @en
comment: Una colección es una entidad que proporciona una estructura a algunos constituyentes, que son a su vez entidades. Se dice que estos constituyentes son miembros de las colecciones.

wasDerivedFrom
type: ObjectProperty
domain: Entity
range: Entity
comment: A derivation is a transformation of an entity into another, an update of an entity resulting in a new one, or the construction of a new entity based on a pre-existing entity. @en
comment: Una derivación es una transformación de una entidad en otra, una actualización de una entidad que da lugar a una nueva, o la construcción de una nueva entidad basada en una entidad preexistente.

es miembro de
type: ObjectProperty
domain: Incendio forestal
range: Collection
label: was member of @en

es causa de
type: ObjectProperty
inverse of: tiene causa
domain: Concepto
range: Incendio forestal
comment: Relaciona una causa del fuego con el incendio forestal.
comment: Relates a cause of the fire with the forest fire. @en
label: was cause of @en

tiempo de exposición
type: ObjectProperty
domain: Incendio forestal
range: Intervalo temporal
comment: Relaciona un incendio forestal con el intervalo de tiempo entre la detección y la extinción del fuego.
comment: Relates a Forest Fire to the time interval between detection and extinguishment of the fire. @en
label: time exposure @en

tiene causa
type: ObjectProperty
domain: Incendio forestal
range: Concepto
comment: Relaciona un incendio forestal con la causa del fuego.
comment: Relates a forest fire with the cause of the fire. @en
label: has cause @en

tiene fecha de incendio
type: ObjectProperty
domain: Incendio forestal
comment: Relaciona un incendio forestal con el año en que se produjo.
comment: Relate a Forest Fire with the year in which it occurred. @en
label: has fire year @en

tiene superficie agrícola
type: ObjectProperty
domain: Incendio forestal
range: Superficie agrícola
comment: Relaciona un incendio forestal con la superficie agrícola quemada.
comment: Relates a Forest Fire to the agricultural area burned. @en
label: has agricultural area @en

has wooded area
type: ObjectProperty
domain: Incendio forestal
range: Superficie arbolada
comment: Relaciona un incendio forestal con la superficie arbolada quemada.
label: Relates a Forest Fire to the wooded area burned. @en
label: tiene superficie arbolada

tiene superficie forestal
type: ObjectProperty
domain: Incendio forestal
range: Superficie forestal
comment: Relaciona un incendio forestal con la superficie forestal quemada.
comment: Relates a Forest Fire to the forest area burned. @en
label: has forestal area @en

tiene superficie no arbolada
type: ObjectProperty
domain: Incendio forestal
range: Superficie no arbolada
comment: Relaciona un incendio forestal con la superficie no arbolada quemada.
label: Relates a Forest Fire to the treeless area burned. @en
label: has treeless area @en

tiene superficie no forestal
type: ObjectProperty
domain: Incendio forestal
range: Superficie no forestal
comment: Relaciona un incendio forestal con la superficie no forestal quemada.
comment: Relates a Forest Fire to the non-forest area burned. @en
label: has non forest area @en

Spatial Reference System
type: ObjectProperty
domain: Geometry
range: Concepto
label: Sistema de referencia espacial

identificador
type: DatatypeProperty
comment: An unambiguous reference to the resource within a given context. @en
comment: Una referencia inequívoca al recurso dentro de un contexto determinado.
label: identifier @en

código
type: DatatypeProperty
comment: A code is a string that uniquely identifies a QUDT concept. The code is constructed from the designator. The use of this property has been deprecated @en
comment: Un código es una cadena que identifica de forma exclusiva un concepto QUDT. El código se construye a partir del designador. El uso de esta propiedad ha quedado obsoleto
label: code @en

numeric value
type: DatatypeProperty
range: float
label: valor númerico

código ucum
type: DatatypeProperty
comment: ucumCode asocia una unidad QUDT con su código UCUM (distingue entre mayúsculas y minúsculas). En SHACL los valores se derivan de las propiedades ucum específicas utilizando 'sh:values'.
comment: ucumCode associates a QUDT unit with its UCUM code (case-sensitive). In SHACL the values are derived from specifi ucum properties using 'sh:values'. @en
label: ucum code @en

código común unece
type: DatatypeProperty
label: unece common code @en

código de la entidad territorial según el INE
type: DatatypeProperty
domain: Municipio
domain: Provincia
range: string
comment: Código de la entidad territorial del INE. Por ejemplo, para municipios este código es de tres dígitos y está definido en http://www.ine.es/daco/daco42/codmun/codmun09/09codmun.xls
label: code of the territorial entity according to INE (National Statistics Institute of Spain) @en

nombre oficial
type: DatatypeProperty
range: string
comment: Un nombre en el idioma oficial local
label: official name @en

asWKT
type: DatatypeProperty
domain: Geometry
range: Well-known Text Literal
comment: The WKT serialization of a geometry @en
label: como WKT

en fecha XSD
type: DatatypeProperty
domain: Instante temporal
range: date
description: This datatype is modeled after the calendar dates defined in Chapter 5.2.1 of ISO (International Organization for Standardization) 8601. Its value space is the set of Gregorian calendar dates as defined by this standard; i.e., a one-day-long period of time. Its lexical space is the ISO 8601 extended format: [-]CCYY-MM-DD[Z|(+|-)hh:mm] with an optional time zone. Time zones that aren't specified are considered undetermined. @en
description: Este tipo de datos se inspira en las fechas del calendario definidas en el capítulo 5.2.1 de la norma ISO 8601 (Organización Internacional de Normalización). Su espacio de valores es el conjunto de fechas del calendario gregoriano definido por esta norma, es decir, un período de tiempo de un día. Su espacio léxico es el formato extendido de la ISO 8601: [-]CCYY-MM-DD[Z|(+|-)hh:mm] con una zona horaria opcional. Las zonas horarias que no se especifican se consideran indeterminadas.
comment: Position of an instant, expressed using xsd:date @en
label: in XSD date @en

year
type: DatatypeProperty
range: string
comment: Año en que se produjo el incendio forestal.
comment: Year in which the Forest Fire occurred. @en
label: año

cuadro delimitador
type: DatatypeProperty
domain: Location
range: Well-known Text Literal
comment: El rango de esta propiedad es intencionadamente genérico, con el fin de permitir diferentes codificaciones de la geometría. Por ejemplo, la geometría podría codificarse como WKT (geosparql:wktLiteral [GeoSPARQL]) o [GML] (geosparql:asGML [GeoSPARQL]).
label: bounding box @en
scope note: The range of this property is intentionally generic, with the purpose of allowing different geometry encodings. E.g., the geometry could be encoded with as WKT (geosparql:wktLiteral [GeoSPARQL]) or [GML] (geosparql:asGML [GeoSPARQL]). @en

palabra clave
type: DatatypeProperty
domain: Dataset
range: Literal
comment: A keyword or tag describing the resource. @en
comment: Una palabra clave o etiqueta que describe el recurso.
label: keyword @en

ID de incendio forestal
type: DatatypeProperty
domain: Incendio forestal
range: string
comment: Relaciona un Incendio Forestal con su identificador de incendio nacional.
comment: Relates a Forest Fire with its country fire identifier. @en
label: Forest fire ID @en

tipoCausaID
type: DatatypeProperty
sub property of: identificador
comment: Forest fire cause ID (National scheme) @en
comment: Forest fire cause ID acording to national forest-fire scheme @en
comment: ID de causa de incendio forestal (Esquema nacional)
comment: ID de causa de incendio forestal según esquema nacional de causas de incendio

tipoCausaIdUE
type: DatatypeProperty
sub property of: identificador
comment: Forest fire cause ID (European scheme)
comment: ID (EU scheme)
comment: ID recorded under the european forest-fire scheme @en
comment: ID según esquema europeo de causas de incendio

Distrito
type: Class
subclass of: GovernmentalAdministrativeRegion
label: District @en

GovernmentalAdministrativeRegion
type: Class
equivalent class: AdministrativeArea
comment: An administrative body governing some territorial unity, in this case a governmental administrative body @en
comment: Órgano administrativo que rige alguna unidad territorial, en este caso un órgano administrativo gubernamental

Municipio
type: Class
subclass of: GovernmentalAdministrativeRegion
label: Municipality @en

Event
type: Class
comment: An arbitrary classification of a space/time region, by a cognitive agent. An event may have actively participating agents, passive factors, products, and a location in space/time. @en
comment: Una clasificación arbitraria de una región del espacio/tiempo, por parte de un agente cognitivo. Un evento puede tener agentes que participan activamente, factores pasivos, productos y una ubicación en el espacio/tiempo.

Agent
type: Class
comment: A resource that acts or has the power to act. @en
comment: Un recurso que actúa o tiene el poder de actuar.

LicenseDocument
type: Class
comment: A legal document giving official permission to do something with a resource. @en
comment: Un documento legal que da permiso oficial para hacer algo con un recurso.

LinguisticSystem
type: Class
comment: A system of signs, symbols, sounds, gestures, or rules used in communication. @en
comment: Sistema de signos, símbolos, sonidos, gestos o reglas utilizados en la comunicación.

Location
type: Class
comment: A spatial region or named place. @en
comment: Una región espacial o un lugar con nombre.

PeriodOfTime
type: Class
comment: An interval of time that is named or defined by its start and end dates. @en
comment: Un intervalo de tiempo que se nombra o define por sus fechas de inicio y fin.

ProvenanceStatement
type: Class
comment: A statement of any changes in ownership and custody of a resource since its creation that are significant for its authenticity, integrity, and interpretation. @en
comment: Una declaración de cualquier cambio en la propiedad y custodia de un recurso desde su creación que sea significativo para su autenticidad, integridad e interpretación.

RightsStatement
type: Class
comment: A statement about the intellectual property rights (IPR) held in or over a resource, a legal document giving official permission to do something with a resource, or a statement about access rights. @en
comment: Una declaración sobre los derechos de propiedad intelectual (DPI) que se tienen sobre un recurso, un documento legal que da permiso oficial para hacer algo con un recurso o una declaración sobre los derechos de acceso.

Standard
type: Class
comment: A reference point against which other things can be evaluated or compared. @en
comment: Un punto de referencia con el que se pueden evaluar o comparar otras cosas.

Cantidad
type: Class
label: Quantity @en

Valor de la cantidad
type: Class
comment: A Quantity Value expresses the magnitude and kind of a quantity and is given by the product of a numerical value n and a unit of measure U. The number multiplying the unit is referred to as the numerical value of the quantity expressed in that unit. Refer to NIST SP 811 section 7 for more on quantity values.
label: Quantity value @en

Unidad
type: Class
subclass of: Restriction
  on property: código común unece
  max cardinality: 1
comment: A unit of measure, or unit, is a particular quantity value that has been chosen as a scale for measuring other quantities the same kind (more generally of equivalent dimension). For example, the meter is a quantity of length that has been rigorously defined and standardized by the BIPM (International Board of Weights and Measures). Any measurement of the length can be expressed as a number multiplied by the unit meter. More formally, the value of a physical quantity Q with respect to a unit (U) is expressed as the scalar multiple of a real number (n) and U, as \\(Q = nU\\).
label: Unit @en

Municipio
type: Class
subclass of: AdministrativeArea
subclass of: Restriction
  on property: pertenece a provincia
  qualified cardinality: 1
  on class: Provincia
subclass of: Restriction
  on property: código de la entidad territorial según el INE
  all values from: string
disjoint with: Provincia
comment: Un Municipio es el ente local definido en el artículo 140 de la Constitución española y la entidad básica de la organización territorial del Estado según el artículo 1 de la Ley 7/1985, de 2 de abril, Reguladora de las Bases del Régimen Local. Tiene personalidad jurídica y plena capacidad para el cumplimiento de sus fines. La delimitación territorial de Municipio está recogida del REgistro Central de Cartografía del IGN. Su nombre, que se especifica con la propiedad dct:title, es el proporcionado por el Registro de Entidades Locales del Ministerio de Política Territorial, en http://www.ine.es/nomen2/index.do

Un país
type: Class
subclass of: Country
subclass of: AdministrativeArea

Provincia
type: Class
subclass of: AdministrativeArea
subclass of: Restriction
  on property: pertenece a provincia
  qualified cardinality: 1
  on class: Un país
subclass of: Restriction
  on property: código de la entidad territorial según el INE
  all values from: string
comment: Cada una de las grandes divisiones de un territorio o Estado, sujeta por lo común a una autoridad administrativa [fuente: Diccionario de la lengua española (DRAE) 2011]
label: Province @en

Feature
type: Class
comment: Esta clase representa el tipo de característica de nivel superior. Esta clase es equivalente a GFI_Feature, definida en la norma ISO 19156:2011, y es la superclase de todos los tipos de características.
comment: This class represents the top-level feature type. This class is equivalent to GFI_Feature defined in ISO 19156:2011, and it is superclass of all feature types. @en

Geometry
type: Class
subclass of: Feature
comment: The class represents the top-level geometry type. This class is equivalent to the UML class GM_Object defined in ISO 19107, and it is superclass of all geometry types. @en

Concepto
type: Class
description: A SKOS concept can be viewed as an idea or notion; a unit of thought. However, what constitutes a unit of thought is subjective, and this definition is meant to be suggestive, rather than restrictive. The notion of a SKOS concept is useful when describing the conceptual or intellectual structure of a knowledge organization system, and when referring to specific ideas or meanings established within a KOS. @en
comment: Un concepto SKOS puede considerarse una idea o noción, una unidad de pensamiento. Sin embargo, lo que constituye una unidad de pensamiento es subjetivo, y esta definición pretende ser sugerente, más que restrictiva. La noción de concepto SKOS es útil para describir la estructura conceptual o intelectual de un sistema de organización del conocimiento, y para referirse a ideas o significados específicos establecidos dentro de un KOS.
label: Concept @en

Esquema conceptual
type: Class
description: A SKOS concept scheme can be viewed as an aggregation of one or more SKOS concepts. Semantic relationships (links) between those concepts may also be viewed as part of a concept scheme. This definition is, however, meant to be suggestive rather than restrictive, and there is some flexibility in the formal data model stated below. The notion of a concept scheme is useful when dealing with data from an unknown source, and when dealing with data that describes two or more different knowledge organization systems. @en
comment: Un esquema de conceptos SKOS puede verse como una agregación de uno o más conceptos SKOS. Las relaciones semánticas (enlaces) entre esos conceptos también pueden considerarse parte de un esquema de conceptos. Sin embargo, esta definición pretende ser sugerente y no restrictiva, y existe cierta flexibilidad en el modelo de datos formal que se expone a continuación. La noción de esquema conceptual es útil cuando se trata de datos de una fuente desconocida y cuando se trata de datos que describen dos o más sistemas de organización del conocimiento diferentes.
label: Concept schema @en

Instante temporal
type: Class
comment: A temporal entity with zero extent or duration @en
comment: Una entidad temporal con extensión o duración cero
label: Time instant @en

Intervalo temporal
type: Class
comment: A temporal entity with an extent or duration @en
comment: Una entidad temporal con una extensión o duración
label: Time interval @en

Kind
type: Class
comment: La clase padre de todos los objetos
comment: The parent class for all objects @en

Catalog
type: Class
subclass of: Dataset
subclass of: Restriction
  on property: hasPart
  all values from: Resource
comment: A curated collection of metadata about resources (e.g., datasets and data services in the context of a data catalog). @en
comment: Una colección curada de metadatos sobre recursos (por ejemplo, conjuntos de datos y servicios de datos en el contexto de un catálogo de datos).
label: Catálogo

Dataset
type: Class
subclass of: Resource
comment: A collection of data, published or curated by a single agent, and available for access or download in one or more representations. @en
comment: Una colección de datos, publicada o comisariada por un único agente, y disponible para su acceso o descarga en una o varias representaciones.
label: Conjunto de datos

Distribución
type: Class
comment: A specific representation of a dataset. A dataset might be available in multiple serializations that may differ in various ways, including natural language, media-type or format, schematic organization, temporal and spatial resolution, level of detail or profiles (which might specify any or all of the above). @en
comment: Una representación específica de un conjunto de datos. Un conjunto de datos puede estar disponible en múltiples serializaciones que pueden diferir en varios aspectos, como el lenguaje natural, el tipo de medio o el formato, la organización esquemática, la resolución temporal y espacial, el nivel de detalle o los perfiles (que pueden especificar alguno o todos los anteriores).
label: Distribution @en

MediaType
type: Class
comment: A file format or physical medium. @en
comment: Un formato de archivo o soporte físico.

Resource
type: Class
comment: Recurso publicado o comisariado por un único agente.
comment: Resource published or curated by a single agent. @en
label: Recurso
scope note: La clase de todos los recursos catalogados, la superclase de dcat:Dataset, dcat:DataService, dcat:Catalog y cualquier otro miembro de un dcat:Catalog. Esta clase contiene propiedades comunes a todos los recursos catalogados, incluidos los conjuntos de datos y los servicios de datos. Se recomienda encarecidamente utilizar una subclase más específica. Cuando se describa un recurso que no sea un dcat:Dataset o dcat:DataService, se recomienda crear una subclase adecuada de dcat:Resource, o utilizar dcat:Resource con la propiedad dct:type para indicar el tipo específico.
scope note: The class of all cataloged resources, the super-class of dcat:Dataset, dcat:DataService, dcat:Catalog and any other member of a dcat:Catalog. This class carries properties common to all cataloged resources, including datasets and data services. It is strongly recommended to use a more specific sub-class. When describing a resource which is not a dcat:Dataset or dcat:DataService, it is recommended to create a suitable sub-class of dcat:Resource, or use dcat:Resource with the dct:type property to indicate the specific type. @en

Collection
type: Class
subclass of: Entity
comment: A collection is an entity that provides a structure to some constituents, which are themselves entities. These constituents are said to be member of the collections. @en
comment: Una colección es una entidad que proporciona una estructura a algunos constituyentes, que son a su vez entidades. Se dice que estos constituyentes son miembros de las colecciones.
label: Colección

Entity
type: Class
subclass of: Distribución
comment: An entity is a physical, digital, conceptual, or other kind of thing with some fixed aspects; entities may be real or imaginary. @en
comment: Una entidad es una cosa física, digital, conceptual o de otro tipo con algunos aspectos fijos; las entidades pueden ser reales o imaginarias.

Area
type: Class
subclass of: Cantidad
subclass of: Restriction
  on property: unit
  has value: Hectare
comment: Área

Año
type: Class
subclass of: Collection
comment: Año del incendio forestal
comment: Forest fire year @en
label: Year @en

Incendio forestal
type: Class
subclass of: Event
subclass of: Feature
subclass of: Entity
subclass of: Restriction
  on property: tiene superficie forestal
  max qualified cardinality: 1
  on class: Superficie forestal
comment: A Forest Fire or wildfire represents a fire occurrence and spreading on vegetated land. @en
comment: Un ForestFire o incendio forestal representa la aparición y propagación de un fuego en un terreno con vegetación.
label: Forest fire or wildfire @en

Superficie agrícola
type: Class
subclass of: Area
comment: Una zona formada por superficie agrícola.
label: Agricultural area @en

Superficie arbolada
type: Class
subclass of: Superficie forestal
label: Wooded area @en

Superficie forestal
type: Class
subclass of: Area
comment: Suma de la superficie total arbolada y no arbolada.
label: Forest area @en

Superficie no arbolada
type: Class
subclass of: Superficie forestal
label: Treeless area @en

Superficie no forestal
type: Class
subclass of: Area
comment: Suma de la superficie total no forestal.
label: Non Forest area @en

Spain
type: NamedIndividual
type: Un país
label: España

forest fires or wild fires
type: NamedIndividual
type: Concepto
description: Forest fire means fire which breaks out and spreads on forest and other wooded land or which breaks out on other land and spreads to forest and other wooded land. The definition of forest fire excludes prescribed or controlled burning, usually with the aim of reducing or eliminating the quantity of accumulated fuel on the ground (Regulation EC 2152/2003 - Forest Focus). Wildland Fire: Any fire occurring on wildland regardless of ignition sources, damages or benefits (FAO, 2011, Wildland Fire Management Terminology, FAO, updated September 2010). @en

Spatial reference system
type: NamedIndividual
type: Esquema conceptual
description: System for identifying position in the real world [ISO 19112] @en
same as: http://inspire.ec.europa.eu/glossary/SpatialReferenceSystem:2"

Hectare
type: NamedIndividual
type: Unidad
código ucum: har
código común unece: HAR
description: The customary metric unit of land area, equal to 100 ares. One hectare is a square hectometer, that is, the area of a square 100 meters on each side: exactly 10 000 square meters or approximately 107 639.1 square feet, 11 959.9 square yards, or 2.471 054 acres. @en

EPSG-0
type: NamedIndividual
type: Esquema conceptual

ETRS89 / UTM zone 27N
type: NamedIndividual
type: Standard
type: Concepto
type: Spatial reference system

ETRS89 / UTM zone 28N
type: NamedIndividual
type: Standard
type: Concepto
type: Spatial reference system

ETRS89 / UTM zone 29N
type: NamedIndividual
type: Standard
type: Concepto
type: Spatial reference system

ETRS89 / UTM zone 30N
type: NamedIndividual
type: Standard
type: Concepto
type: Spatial reference system

ETRS89 / UTM zone 31N
type: NamedIndividual
type: Standard
type: Concepto
type: Spatial reference system

Colección de incendios forestales de España
type: NamedIndividual
type: Collection
comment: Colección que contiene todas las entidades de Incendios Forestales de España con su información y geometrías.
comment: Collection containing all the Forest Fire entities of Spain with their information and geometries. @en
label: Spain Forest Fire Collection @en