Ontología del INES
type: Ontology
version IRI: https://datos.iepnb.es/def/sector-publico/medio-ambiente/ines/1.0
creator: Tragsatec
date: 2021-02-25
description: An RDF/OWL vocabulary to represent spatial information on soil erosion according to the spanish National Soil Erosion Inventory (INES, in spanish).
description: Un vocabulario RDF/OWL para representar información espacial sobre erosión del suelo de acuerdo con el Inventario Nacional de Erosión de Suelos (INES) de España. @es
Preferred Namespace Prefix: ines
version info: 1.0
change note: 2021-02-12 - Creación de la ontología OWL INES. @es
change note: 2021-02-25 - Corrección de errores (añadir la propiedad de datos time:inXSDDateTime para la clase time:Instant). @es
change note: 2021-02-26 - Añadir el módulo DCAT para publicar catálogos de metadatos en la web. @es

Preferred Namespace Prefix
type: AnnotationProperty
comment: The preferred namespace prefix to use when using terms from this vocabulary in an XML document.

Preferred Namespace Uri
type: AnnotationProperty
comment: The preferred namespace URI to use when using terms from this vocabulary in an XML document.

Well-known Text Literal
type: Datatype

catalog
type: ObjectProperty
sub property of: hasPart
sub property of: member
domain: Catalog
range: Catalog
comment: A catalog whose contents are of interest in the context of this catalog.

dataset
type: ObjectProperty
sub property of: hasPart
sub property of: member
domain: Catalog
range: Dataset
comment: A collection of data that is listed in the catalog.

service
type: ObjectProperty
sub property of: hasPart
sub property of: member
domain: Catalog
range: DataService
comment: A site or endpoint that is listed in the catalog.

conformsTo
type: ObjectProperty
range: Standard
comment: An established standard to which the described resource conforms.

format
type: ObjectProperty
range: MediaTypeOrExtent
description: Examples of dimensions include size and duration. Recommended best practice is to use a controlled vocabulary such as the list of Internet Media Types [MIME].
comment: The file format of the distribution.

language
type: ObjectProperty
range: LinguisticSystem
comment: A language of the resource.

license
type: ObjectProperty
range: LicenseDocument
description: Information about licenses and rights MAY be provided for the Resource. See also guidance at § 8. License and rights statements.
comment: A legal document under which the resource is made available.

provenance
type: ObjectProperty
range: ProvenanceStatement
comment: A statement of any changes in ownership and custody of the resource since its creation that are significant for its authenticity, integrity, and interpretation.

publisher
type: ObjectProperty
range: Agent
comment: Examples of a Publisher include a person, an organization, or a service. Typically, the name of a Publisher should be used to indicate the entity.

rights
type: ObjectProperty
range: RightsStatement
description: Information about licenses and rights MAY be provided for the Resource. See also guidance at § 8. License and rights statements.
comment: A statement that concerns all rights not addressed with dct:license or dcterms:accessRights, such as copyright statements.

spatial
type: ObjectProperty
range: Location
comment: Spatial characteristics of the resource.

temporal
type: ObjectProperty
range: PeriodOfTime
comment: Temporal characteristics of the resource.

type
type: ObjectProperty
domain: Dataset
description: Recommended practice is to use a controlled vocabulary such as the DCMI Type Vocabulary [DCMI-TYPE]. To describe the file format, physical medium, or dimensions of the resource, use the property Format.
comment: The nature or genre of the resource.

has quantity
type: ObjectProperty
range: Quantity
description: a property to relate an observable thing with a quantity (qud:Quantity)

unit
type: ObjectProperty
range: Unit
description: A reference to the unit of measure of a quantity (variable or constant) of interest.

Contains
type: ObjectProperty
inverse of: isIn
domain: Frame
range: Pixel
comment: Relates a Frame with its Pixels

isIn
type: ObjectProperty
domain: Pixel
range: Frame
comment: Relates a Pixel with its Frame

isLocationOf
type: ObjectProperty
inverse of: location
domain: Place
range: Event
comment: Relates a Place with its Events

isReferredBy
type: ObjectProperty
inverse of: refers
range: Pixel
comment: Relates a Cell with its Pixels

location
type: ObjectProperty
domain: Event
range: Place
comment: Relates an Event with its Pixel

refers
type: ObjectProperty
domain: Pixel
comment: Relates Pixel to its Cell

frappe:samplingTime
type: ObjectProperty
domain: CapturedFrame
range: Instante
comment: Relates a Frame with its creation Instant

timeExposure
type: ObjectProperty
domain: CapturedFrame
range: Intervalo
comment: Relate a Capture Frame to the time interval needed to capture a minimum quantity of data

wasCapturedFrom
type: ObjectProperty
domain: CapturedFrame
comment: Relates a Frame to a Grid

wasSynthetizedFrom
type: ObjectProperty
range: Frame
comment: Relates a Synthetic Frame to the elements needed to the Synthetization

pertenece a la autonomía
type: ObjectProperty
sub property of: within
issued: 2014-03-28
comment: Autonomía (Comunidad Autónoma o Ciudad Autónoma) a la que pertenece un fenómeno geográfico o una entidad administrativa @es

es capital de
type: ObjectProperty
sub property of: within
issued: 2018-01-08
comment: Especifica una unidad territorial de la que esta unidad territorial es capital @es

isla
type: ObjectProperty
sub property of: within
issued: 2014-05-03
comment: Isla a la que pertenece un fenómeno geográfico o una entidad administrativa @es

pertenece al municipio
type: ObjectProperty
sub property of: within
range: Municipio
issued: 2014-03-28
comment: Municipio al que pertenece un fenómeno geográfico o una entidad administrativa @es

pertenece al país
type: ObjectProperty
sub property of: within
range: País
issued: 2014-03-28
comment: País al que pertenece un fenómeno geográfico o una entidad administrativa @es

pertenece a provincia
type: ObjectProperty
sub property of: within
range: Provincia
issued: 2014-04-15
comment: Provincia a la que pertenece un fenómeno geográfico o una entidad administrativa @es

hasGeometry
type: ObjectProperty
inverse of: esGeometriaDe
domain: Feature
range: Geometry
creator: OGC GeoSPARQL 1.0 Standard Working Group
description: A spatial representation for a given feature.

contains
type: ObjectProperty
domain: SpatialObject
range: SpatialObject
creator: OGC GeoSPARQL 1.0 Standard Working Group
description: Existe si el sujeto SpatialObject contiene espacialmente el objeto SpatialObject. @es
description: Exists if the subject SpatialObject spatially contains the object SpatialObject. DE-9IM: T*****FF*

within
type: ObjectProperty
domain: SpatialObject
range: SpatialObject
creator: OGC GeoSPARQL 1.0 Standard Working Group
description: Existe si el sujeto SpatialObject está espacialmente dentro del objeto SpatialObject. @es
description: Exists if the subject SpatialObject is spatially within the object SpatialObject. DE-9IM: T*F**F***

has exact match
type: ObjectProperty
type: SymmetricProperty

hasTopConcept
type: ObjectProperty
sub property of:
  inverse of: inScheme
inverse of: topConceptOf
domain: ConceptScheme
range: Concept
description: Relates, by convention, a concept scheme to a concept which is topmost in the broader/narrower concept hierarchies for that scheme, providing an entry point to these hierarchies.

accessURL
type: ObjectProperty
domain: Distribution
range: Resource
description: dcat:accessURL SHOULD be used for the URL of a service or location that can provide access to this distribution, typically through a Web form, query or API call. dcat:downloadURL is preferred for direct links to downloadable resources. If the distribution(s) are accessible only through a landing page (i.e. direct download URLs are not known), then the landing page URL associated with the dcat:Dataset SHOULD be duplicated as access URL on a distribution (see § 5.7 Dataset available only behind some Web page).
comment: A URL of the resource that gives access to a distribution of the dataset. E.g. landing page, feed, SPARQL endpoint.

contactPoint
type: ObjectProperty
range: Kind
comment: Relevant contact information for the cataloged resource. Use of vCard is recommended.

distribution
type: ObjectProperty
domain: Dataset
range: Distribution
comment: An available distribution of the dataset.

endpointURL
type: ObjectProperty
domain: DataService
range: Resource
comment: The root location or primary endpoint of the service (a web-resolvable IRI).

theme
type: ObjectProperty
range: Concept
definition: A main Categoria of the resource. A resource can have multiple themes.
scope note: The set of skos:Concepts used to categorize the resources are organized in a skos:ConceptScheme describing all the categories and their relations in the catalog.

The pixel value is in the Pixel/Cell.
type: ObjectProperty
label: El valor del píxel esta en el Píxel/Celda. @es

The pixel value is restricted by the Captured Frame.
type: ObjectProperty
domain: ValorPixel
range: CapturedFrame
label: El valor del píxel está limitado por el Marco Capturado @es

Pixel value belongs to Captured Frame
type: ObjectProperty
domain: ValorPixel
range: CapturedFrame
label: El valor del píxel pertenece al Marco Capturado @es

conversion coefficient
type: DatatypeProperty
range: double

height
type: DatatypeProperty
range: string

latex symbol
type: DatatypeProperty
sub property of: literal
range: string
description: The symbol is a glyph that is used to represent some concept, typically a unit or a quantity, in a compact form. For example, the symbol for an Ohm is $\ohm$. This contrasts with 'unit:abbreviation', which gives a short alphanumeric abbreviation for the unit, 'ohm' for Ohm.

literal
type: DatatypeProperty
sub property of: literal
range: string

symbol token
type: DatatypeProperty
sub property of: literal
range: token
description: A token represents tokenized strings. The value space of token is the set of strings that do not contain the carriage return (#xD), line feed (#xA) nor tab (#x9) characters, that have no leading or trailing spaces (#x20) and that have no internal sequences of two or more spaces. The lexical space· of token is the set of strings that do not contain the carriage return (#xD), line feed (#xA) nor tab (#x9) characters, that have no leading or trailing spaces (#x20) and that have no internal sequences of two or more spaces. The base type of token is normalizedString.
was quoted from: token

width
type: DatatypeProperty
range: string

código de país ISO
type: DatatypeProperty
range: string
comment: Un código de país de dos letras, de la lista ISO 3166 @es

literal
type: DatatypeProperty
range: string
comment: A general purpose property for holding string literals.

asGML
type: DatatypeProperty
sub property of: has serialization
domain: Geometry
range: gmlLiteral
contributor: Matthew Perry
creator: OGC GeoSPARQL 1.0 Standard Working Group
date: 2011-06-16
description: The GML serialization of a geometry

asWKT
type: DatatypeProperty
sub property of: has serialization
domain: Geometry
range: Well-known Text Literal
contributor: Matthew Perry
creator: OGC GeoSPARQL 1.0 Standard Working Group
date: 2011-06-16
description: The WKT serialization of a geometry

has serialization
type: DatatypeProperty
domain: Geometry
range: Literal
contributor: Matthew Perry
creator: OGC GeoSPARQL 1.0 Standard Working Group
date: 2011-06-16
description: Connects a geometry object with its text-based serialization.

keyword
type: DatatypeProperty
range: Literal
comment: A keyword or tag describing the resource.

code
type: DatatypeProperty
domain: Celda
range: string
description: El código que identifica la celda en la malla a la que pertenece. @es
description: The code that identifies the cell in the grid.
label: código @es

column
type: DatatypeProperty
domain: Celda
range: integer
description: El número que identifica la columna de la celda en la malla a la que pertenece. Este número permitirá obtener las celdas adyacentes en el eje horizontal. @es
description: The number that identifies the column the cell belongs to in the grid. It will allow to obtain the adjacent cells in the horizontal axis.
label: columna @es

row
type: DatatypeProperty
domain: Celda
range: integer
description: El número que identifica la fila de la celda en la malla a la que pertenece. Este número permitirá obtener las celdas adyacentes en el eje vertical. @es
description: The number that identifies the row the cell belongs to in the grid. It will allow to obtain the adjacent cells in the vertical axis.
label: fila @es

LicenseDocument
type: Class
comment: A legal document giving official permission to do something with a resource.

LinguisticSystem
type: Class
description: Examples include written, spoken, sign, and computer languages.
comment: A system of signs, symbols, sounds, gestures, or rules used in communication.

Location
type: Class
comment: A spatial region or named place.

MediaTypeOrExtent
type: Class
comment: A media type or extent.

PeriodOfTime
type: Class
comment: An interval of time that is named or defined by its start and end dates.

ProvenanceStatement
type: Class
comment: A statement of any changes in ownership and custody of a resource since its creation that are significant for its authenticity, integrity, and interpretation.

RightsStatement
type: Class
comment: A statement about the intellectual property rights (IPR) held in or over a resource, a legal document giving official permission to do something with a resource, or a statement about access rights.

Standard
type: Class
comment: A reference point against which other things can be evaluated or compared.

QUDT Concept
type: Class
subclass of: Restriction
  on property: url
  min cardinality: 0
subclass of: Restriction
  on property: longDescription
  max cardinality: 1
subclass of: Restriction
  on property: title
  max cardinality: 1
description: The root class for all QUDT concepts.
comment: La clase raíz para todos los conceptos de QUDT. @es

Derived Unit
type: Class
subclass of: Unit
description: A DerivedUnit is a type specification for units that are derived from other units.
deprecated: true

Quantity
type: Class
subclass of: QUDT Concept
subclass of: Restriction
  on property: hasQuantityKind
  all values from: Quantity Kind
subclass of: Restriction
  on property: quantityValue
  all values from: Quantity value
subclass of: Restriction
  on property: quantityValue
  min cardinality: 1
subclass of: Restriction
  on property: baseUnitDimensions
  max cardinality: 1
subclass of: Restriction
  on property: mathMLdefinition
  max cardinality: 1
description: A quantity is the measurement of an observable property of a particular object, event, or physical system. A quantity is always associated with the context of measurement (i.e. the thing measured, the measured value, the accuracy of measurement, etc.) whereas the underlying quantity kind is independent of any particular measurement. Thus, length is a quantity kind while the height of a rocket is a specific quantity of length; its magnitude that may be expressed in meters, feet, inches, etc. Examples of physical quantities include physical constants, such as the speed of light in a vacuum, Planck's constant, the electric permittivity of free space, and the fine structure constant. In other words, quantities are quantifiable aspects of the world, such as time, distance, velocity, mass, momentum, energy, and weight, and units are used to describe their measure. Many of which are related to each other by various physical laws, and as a result the units of some of the quantities can be expressed as products (or ratios) of powers of other units (e.g., momentum is mass times velocity and velocity is measured in distance divided by time). These relationships are discussed in dimensional analysis. Those that cannot be so expressed can be regarded as "fundamental" in this sense. A quantity is distinguished from a "quantity kind" in that the former carries a value and the latter is a type specifier.

Quantity Kind
type: Class
subclass of: QUDT Concept
subclass of: Restriction
  on property: broader
  all values from: Quantity Kind
subclass of: Restriction
  on property: baseCGSUnitDimensions
  max cardinality: 1
subclass of: Restriction
  on property: baseISOUnitDimensions
  max cardinality: 1
subclass of: Restriction
  on property: baseImperialUnitDimensions
  max cardinality: 1
subclass of: Restriction
  on property: baseSIUnitDimensions
  max cardinality: 1
subclass of: Restriction
  on property: baseUSCustomaryUnitDimensions
  max cardinality: 1
subclass of: Restriction
  on property: baseUnitDimensions
  max cardinality: 4
subclass of: Restriction
  on property: latex symbol
  max cardinality: 1
subclass of: Restriction
  on property: mathMLdefinition
  max cardinality: 1
subclass of: Restriction
  on property: symbol token
  max cardinality: 1
description: A Quantity Kind is any observable property that can be measured and quantified numerically. Familiar examples include physical properties such as length, mass, time, force, energy, power, electric charge, etc. Less familiar examples include currency, interest rate, price to earning ratio, and information capacity.

Quantity value
type: Class
subclass of: QUDT Concept
subclass of: Restriction
  on property: hasQuantityKind
  all values from: Quantity Kind
subclass of: Restriction
  on property: relativeStandardUncertainty
  all values from: double
subclass of: Restriction
  on property: standardUncertainty
  all values from: double
subclass of: Restriction
  on property: relativeStandardUncertainty
  max cardinality: 1
subclass of: Restriction
  on property: standardUncertainty
  max cardinality: 1
description: A Quantity Value expresses the magnitude and kind of a quantity and is given by the product of a numerical value n and a unit of measure U. The number multiplying the unit is referred to as the numerical value of the quantity expressed in that unit. Refer to NIST SP 811 section 7 for more on quantity values.

Unit
type: Class
subclass of: QUDT Concept
subclass of: Restriction
  on property: hasQuantityKind
  all values from: Quantity Kind
subclass of: Restriction
  on property: baseISOUnitDimensions
  max cardinality: 1
subclass of: Restriction
  on property: baseImperialUnitDimensions
  max cardinality: 1
subclass of: Restriction
  on property: baseSIUnitDimensions
  max cardinality: 1
subclass of: Restriction
  on property: baseUSCustomaryUnitDimensions
  max cardinality: 1
subclass of: Restriction
  on property: baseUnitDimensions
  max cardinality: 4
subclass of: Restriction
  on property: latex symbol
  max cardinality: 1
subclass of: Restriction
  on property: mathMLdefinition
  max cardinality: 1
subclass of: Restriction
  on property: siUnitsExpression
  max cardinality: 1
subclass of: Restriction
  on property: symbol token
  max cardinality: 1
subclass of: Restriction
  on property: uneceCommonCode
  max cardinality: 1
description: A unit of measure, or unit, is a particular quantity value that has been chosen as a scale for measuring other quantities the same kind (more generally of equivalent dimension). For example, the meter is a quantity of length that has been rigorously defined and standardized by the BIPM (International Board of Weights and Measures). Any measurement of the length can be expressed as a number multiplied by the unit meter. More formally, the value of a physical quantity Q with respect to a unit (U) is expressed as the scalar multiple of a real number (n) and U, as \(Q = nU\).

Capture
type: Class
subclass of: Activity
comment: Activity to create new Captured Frame

CapturedFrame
type: Class
subclass of: Frame
comment: Original time varying representation of a Grid, mediated by the Capture activity

Frame
type: Class
subclass of: Entity
comment: A Frame represents a time varying representation of a Grid

Pixel
type: Class
equivalent class: Celda
subclass of: Feature
subclass of: Thing
subclass of: ObjetoGeografico
comment: Un píxel es una representación variable en el tiempo de una célula @es
comment: A Pixel is a time varying representation of a Cell

Place
type: Class
subclass of: Feature
subclass of: ObjetoGeografico
disjoint with: Geometry
disjoint with: Curve
disjoint with: Geometry Collection
disjoint with: Line
disjoint with: Line String
disjoint with: Linear Ring
disjoint with: Multi Curve
disjoint with: Multi Line String
disjoint with: Multi Point
disjoint with: Multi Polygon
disjoint with: Multi Surface
disjoint with: Point
disjoint with: Polygon
disjoint with: Polyhedral Surface
disjoint with: Surface
disjoint with: Triangulated Irregular Network
disjoint with: Triangle
disjoint with: Concept
disjoint with: ConceptScheme
comment: Un Lugar representa un punto en el espacio @es
comment: A Place represents a point in space
label: Lugar @es

Ciudad Autónoma
type: Class
subclass of: Unidad Administrativa
disjoint with: Geometry
disjoint with: Curve
disjoint with: Geometry Collection
disjoint with: Line
disjoint with: Line String
disjoint with: Linear Ring
disjoint with: Multi Curve
disjoint with: Multi Line String
disjoint with: Multi Point
disjoint with: Multi Polygon
disjoint with: Multi Surface
disjoint with: Point
disjoint with: Polygon
disjoint with: Polyhedral Surface
disjoint with: Surface
disjoint with: Triangulated Irregular Network
disjoint with: Triangle
disjoint with: Concept
disjoint with: ConceptScheme

Comunidad Autónoma
type: Class
subclass of: Unidad Administrativa
disjoint with: Geometry
disjoint with: Curve
disjoint with: Geometry Collection
disjoint with: Line
disjoint with: Line String
disjoint with: Linear Ring
disjoint with: Multi Curve
disjoint with: Multi Line String
disjoint with: Multi Point
disjoint with: Multi Polygon
disjoint with: Multi Surface
disjoint with: Point
disjoint with: Polygon
disjoint with: Polyhedral Surface
disjoint with: Surface
disjoint with: Triangulated Irregular Network
disjoint with: Triangle
disjoint with: Concept
disjoint with: ConceptScheme

Comunidad Jurisdiccional
type: Class
subclass of: Unidad Administrativa
disjoint with: Geometry
disjoint with: Curve
disjoint with: Geometry Collection
disjoint with: Line
disjoint with: Line String
disjoint with: Linear Ring
disjoint with: Multi Curve
disjoint with: Multi Line String
disjoint with: Multi Point
disjoint with: Multi Polygon
disjoint with: Multi Surface
disjoint with: Point
disjoint with: Polygon
disjoint with: Polyhedral Surface
disjoint with: Surface
disjoint with: Triangulated Irregular Network
disjoint with: Triangle
disjoint with: Concept
disjoint with: ConceptScheme

Municipio
type: Class
subclass of: Unidad Administrativa
disjoint with: Geometry
disjoint with: Curve
disjoint with: Geometry Collection
disjoint with: Line
disjoint with: Line String
disjoint with: Linear Ring
disjoint with: Multi Curve
disjoint with: Multi Line String
disjoint with: Multi Point
disjoint with: Multi Polygon
disjoint with: Multi Surface
disjoint with: Point
disjoint with: Polygon
disjoint with: Polyhedral Surface
disjoint with: Surface
disjoint with: Triangulated Irregular Network
disjoint with: Triangle
disjoint with: Concept
disjoint with: ConceptScheme

País
type: Class
subclass of: Unidad Administrativa
disjoint with: Geometry
disjoint with: Curve
disjoint with: Geometry Collection
disjoint with: Line
disjoint with: Line String
disjoint with: Linear Ring
disjoint with: Multi Curve
disjoint with: Multi Line String
disjoint with: Multi Point
disjoint with: Multi Polygon
disjoint with: Multi Surface
disjoint with: Point
disjoint with: Polygon
disjoint with: Polyhedral Surface
disjoint with: Surface
disjoint with: Triangulated Irregular Network
disjoint with: Triangle
disjoint with: Concept
disjoint with: ConceptScheme

Provincia
type: Class
subclass of: Unidad Administrativa
disjoint with: Geometry
disjoint with: Curve
disjoint with: Geometry Collection
disjoint with: Line
disjoint with: Line String
disjoint with: Linear Ring
disjoint with: Multi Curve
disjoint with: Multi Line String
disjoint with: Multi Point
disjoint with: Multi Polygon
disjoint with: Multi Surface
disjoint with: Point
disjoint with: Polygon
disjoint with: Polyhedral Surface
disjoint with: Surface
disjoint with: Triangulated Irregular Network
disjoint with: Triangle
disjoint with: Concept
disjoint with: ConceptScheme

Feature
type: Class
equivalent class: ObjetoGeografico
subclass of: SpatialObject
disjoint with: Geometry
disjoint with: Curve
disjoint with: Geometry Collection
disjoint with: Line
disjoint with: Line String
disjoint with: Linear Ring
disjoint with: Multi Curve
disjoint with: Multi Line String
disjoint with: Multi Point
disjoint with: Multi Polygon
disjoint with: Multi Surface
disjoint with: Point
disjoint with: Polygon
disjoint with: Polyhedral Surface
disjoint with: Surface
disjoint with: Triangulated Irregular Network
disjoint with: Triangle
disjoint with: Concept
disjoint with: ConceptScheme
contributor: Matthew Perry
creator: OGC GeoSPARQL 1.0 Standard Working Group
date: 2011-06-16
description: This class represents the top-level feature type. This class is equivalent to GFI_Feature defined in ISO 19156:2011, and it is superclass of all feature types.
description: Esta clase representa el tipo de entidad de nivel superior. Esta clase es equivalente a GFI_Feature definido en ISO 19156: 2011, y es Superclase de todos los tipos Feature. @es

Geometry
type: Class
subclass of: SpatialObject
disjoint with: Concept
disjoint with: ConceptScheme
disjoint with: Celda
disjoint with: Centroide
disjoint with: Malla
disjoint with: Unidad Administrativa
disjoint with: ObjetoGeografico
contributor: Matthew Perry
creator: OGC GeoSPARQL 1.0 Standard Working Group
date: 2011-06-16
description: The class represents the top-level geometry type. This class is equivalent to the UML class GM_Object defined in ISO 19107, and it is superclass of all geometry types.

SpatialObject
type: Class
disjoint with: Concept
disjoint with: ConceptScheme
contributor: Matthew Perry
creator: OGC GeoSPARQL 1.0 Standard Working Group
date: 2011-06-16
description: The class spatial-object represents everything that can have a spatial representation. It is superclass of feature and geometry.

Curve
type: Class
subclass of: Geometry
disjoint with: Concept
disjoint with: ConceptScheme
disjoint with: Celda
disjoint with: Centroide
disjoint with: Malla
disjoint with: Unidad Administrativa
disjoint with: ObjetoGeografico
comment: A Curve is a 1-dimensional geometric object usually stored as a sequence of Points, with the subtype of Curve specifying the form of the interpolation between Points. This specification defines only one subclass of Curve, LineString, which uses linear interpolation between Points. A Curve is a 1-dimensional geometric object that is the homeomorphic image of a real, closed, interval. A Curve is simple if it does not pass through the same Point twice with the possible exception of the two end points. A Curve is closed if its start Point is equal to its end Point. The boundary of a closed Curve is empty. A Curve that is simple and closed is a Ring. The boundary of a non-closed Curve consists of its two end Points. A Curve is defined as topologically closed, that is, it contains its endpoints f(a) and f(b).

Geometry
type: Class
subclass of: Geometry
disjoint with: Concept
disjoint with: ConceptScheme
disjoint with: Celda
disjoint with: Centroide
disjoint with: Malla
disjoint with: Unidad Administrativa
disjoint with: ObjetoGeografico
description: The class represents the top-level geometry type. This class is equivalent to the UML class GM_Object defined in ISO 19107, and it is superclass of all geometry types.
comment: Geometry is the root class of the hierarchy. The instantiable subclasses of Geometry are restricted to 0, 1 and 2-dimensional geometric objects that exist in 2, 3 or 4-dimensional coordinate space (R2, R3 or R4). Geometry values in R2 have points with coordinate values for x and y. Geometry values in R3 have points with coordinate values for x, y and z or for x, y and m. Geometry values in R4 have points with coordinate values for x, y, z and m. The interpretation of the coordinates is subject to the coordinate reference systems associated to the point. All coordinates within a geometry object should be in the same coordinate reference systems. Each coordinate shall be unambiguously associated to a coordinate reference system either directly or through its containing geometry. The z coordinate of a point is typically, but not necessarily, represents altitude or elevation. The m coordinate represents a measurement. All Geometry classes described in this specification are defined so that instances of Geometry are topologically closed, i.e. all represented geometries include their boundary as point sets. This does not affect their representation, and open version of the same classes may be used in other circumstances, such as topological representations.

Geometry Collection
type: Class
subclass of: Geometry
disjoint with: Concept
disjoint with: ConceptScheme
disjoint with: Celda
disjoint with: Centroide
disjoint with: Malla
disjoint with: Unidad Administrativa
disjoint with: ObjetoGeografico
comment: A GeometryCollection is a geometric object that is a collection of some number of geometric objects. All the elements in a GeometryCollection shall be in the same Spatial Reference System. This is also the Spatial Reference System for the GeometryCollection. GeometryCollection places no other constraints on its elements. Subclasses of GeometryCollection may restrict membership based on dimension and may also place other constraints on the degree of spatial overlap between elements.

Line
type: Class
subclass of: Line String
disjoint with: Concept
disjoint with: ConceptScheme
disjoint with: Celda
disjoint with: Centroide
disjoint with: Malla
disjoint with: Unidad Administrativa
disjoint with: ObjetoGeografico
comment: A Line is a LineString with exactly 2 Points.

Line String
type: Class
subclass of: Curve
disjoint with: Concept
disjoint with: ConceptScheme
disjoint with: Celda
disjoint with: Centroide
disjoint with: Malla
disjoint with: Unidad Administrativa
disjoint with: ObjetoGeografico
comment: A LineString is a Curve with linear interpolation between Points. Each consecutive pair of Points defines a Line segment.

Linear Ring
type: Class
subclass of: Line String
disjoint with: Concept
disjoint with: ConceptScheme
disjoint with: Celda
disjoint with: Centroide
disjoint with: Malla
disjoint with: Unidad Administrativa
disjoint with: ObjetoGeografico
comment: A LinearRing is a LineString that is both closed and simple.

Multi Curve
type: Class
subclass of: Geometry Collection
disjoint with: Concept
disjoint with: ConceptScheme
disjoint with: Celda
disjoint with: Centroide
disjoint with: Malla
disjoint with: Unidad Administrativa
disjoint with: ObjetoGeografico
comment: A MultiCurve is a 1-dimensional GeometryCollection whose elements are Curves. A MultiCurve defines a set of methods for its subclasses and is included for reasons of extensibility. A MultiCurve is simple if and only if all of its elements are simple and the only intersections between any two elements occur at Points that are on the boundaries of both elements. The boundary of a MultiCurve is obtained by applying the mod 2 union rule: A Point is in the boundary of a MultiCurve if it is in the boundaries of an odd number of elements of the MultiCurve. A MultiCurve is closed if all of its elements are closed. The boundary of a closed MultiCurve is always empty. A MultiCurve is defined as topologically closed.

Multi Line String
type: Class
subclass of: Multi Curve
disjoint with: Concept
disjoint with: ConceptScheme
disjoint with: Celda
disjoint with: Centroide
disjoint with: Malla
disjoint with: Unidad Administrativa
disjoint with: ObjetoGeografico
comment: A MultiLineString is a MultiCurve whose elements are LineStrings.

Multi Point
type: Class
subclass of: Geometry Collection
disjoint with: Concept
disjoint with: ConceptScheme
disjoint with: Celda
disjoint with: Centroide
disjoint with: Malla
disjoint with: Unidad Administrativa
disjoint with: ObjetoGeografico
comment: A MultiPoint is a 0-dimensional GeometryCollection. The elements of a MultiPoint are restricted to Points. ThePoints are not connected or ordered in any semantically important way. A MultiPoint is simple if no two Points in the MultiPoint are equal (have identical coordinate values in X and Y). Every MultiPoint is spatially equal to a simple Multipoint. The boundary of a MultiPoint is the empty set.

Multi Polygon
type: Class
subclass of: Multi Surface
disjoint with: Concept
disjoint with: ConceptScheme
disjoint with: Celda
disjoint with: Centroide
disjoint with: Malla
disjoint with: Unidad Administrativa
disjoint with: ObjetoGeografico
comment: A MultiPolygon is a MultiSurface whose elements are Polygons. The assertions for MultiPolygons are as follows. a) The interiors of 2 Polygons that are elements of a MultiPolygon may not intersect. b) The boundaries of any 2 Polygons that are elements of a MultiPolygon may not cross and may touch at only a finite number of Points. c) A MultiPolygon is defined as topologically closed. d) A MultiPolygon may not have cut lines, spikes or punctures, a MultiPolygon is a regular closed Point set, e) The interior of a MultiPolygon with more than 1 Polygon is not connected; the number of connected components of the interior of a MultiPolygon is equal to the number of Polygons in the MultiPolygon. The boundary of a MultiPolygon is a set of closed Curves (LineStrings) corresponding to the boundaries of its element Polygons. Each Curve in the boundary of the MultiPolygon is in the boundary of exactly 1 element Polygon, and every Curve in the boundary of an element Polygon is in the boundary of the MultiPolygon.

Multi Surface
type: Class
subclass of: Geometry Collection
disjoint with: Concept
disjoint with: ConceptScheme
disjoint with: Celda
disjoint with: Centroide
disjoint with: Malla
disjoint with: Unidad Administrativa
disjoint with: ObjetoGeografico
comment: A MultiSurface is a 2-dimensional GeometryCollection whose elements are Surfaces, all using coordinates from the same coordinate reference system. The geometric interiors of any two Surfaces in a MultiSurface may not intersect in the full coordinate system. The boundaries of any two coplanar elements in a MultiSurface may intersect, at most, at a finite number of Points. If they were to meet along a curve, they could be merged into a single surface. A MultiSurface may be used to represent heterogeneous surfaces collections of polygons and polyhedral surfaces. It defines a set of methods for its subclasses. The subclass of MultiSurface is MultiPolygon corresponding to a collection of Polygons only. Other collections shall use MultiSurface.

Point
type: Class
subclass of: Geometry
disjoint with: Concept
disjoint with: ConceptScheme
disjoint with: Celda
disjoint with: Centroide
disjoint with: Malla
disjoint with: Unidad Administrativa
disjoint with: ObjetoGeografico
comment: A Point is a 0-dimensional geometric object and represents a single location in coordinate space. A Point has an x-coordinate value, a y-coordinate value. If called for by the associated Spatial Reference System, it may also have coordinate values for z and m. The boundary of a Point is the empty set.

Polygon
type: Class
subclass of: Surface
disjoint with: Concept
disjoint with: ConceptScheme
disjoint with: Celda
disjoint with: Centroide
disjoint with: Malla
disjoint with: Unidad Administrativa
disjoint with: ObjetoGeografico
comment: A Polygon is a planar Surface defined by 1 exterior boundary and 0 or more interior boundaries. Each interior boundary defines a hole in the Polygon. The exterior boundary LinearRing defines the top of the surface which is the side of the surface from which the exterior boundary appears to traverse the boundary in a counter clockwise direction. The interior LinearRings will have the opposite orientation, and appear as clockwise when viewed from the top, The assertions for Polygons (the rules that define valid Polygons) are as follows: a) Polygons are topologically closed; b) The boundary of a Polygon consists of a set of LinearRings that make up its exterior and interior boundaries; c) No two Rings in the boundary cross and the Rings in the boundary of a Polygon may intersect at a Point but only as a tangent. d) A Polygon may not have cut lines, spikes or punctures. e) The interior of every Polygon is a connected point set; f) The exterior of a Polygon with 1 or more holes is not connected. Each hole defines a connected component of the exterior.

Polyhedral Surface
type: Class
subclass of: Surface
disjoint with: Concept
disjoint with: ConceptScheme
disjoint with: Celda
disjoint with: Centroide
disjoint with: Malla
disjoint with: Unidad Administrativa
disjoint with: ObjetoGeografico
comment: A PolyhedralSurface is a contiguous collection of polygons, which share common boundary segments. For each pair of polygons that touch, the common boundary shall be expressible as a finite collection of LineStrings. Each such LineString shall be part of the boundary of at most 2 Polygon patches. For any two polygons that share a common boundary, the top of the polygon shall be consistent. This means that when two LinearRings from these two Polygons traverse the common boundary segment, they do so in opposite directions. Since the Polyhedral surface is contiguous, all polygons will be thus consistently oriented. This means that a non-oriented surface (such as Mbius band) shall not have single surface representations. They may be represented by a MultiSurface. If each such LineString is the boundary of exactly 2 Polygon patches, then the PolyhedralSurface is a simple, closed polyhedron and is topologically isomorphic to the surface of a sphere. By the Jordan Surface Theorem (Jordans Theorem for 2-spheres), such polyhedrons enclose a solid topologically isomorphic to the interior of a sphere; the ball. In this case, the top of the surface will either point inward or outward of the enclosed finite solid. If outward, the surface is the exterior boundary of the enclosed surface. If inward, the surface is the interior of the infinite complement of the enclosed solid. A Ball with some number of voids (holes) inside can thus be presented as one exterior boundary shell, and some number in interior boundary shells.

Surface
type: Class
subclass of: Geometry
disjoint with: Concept
disjoint with: ConceptScheme
disjoint with: Celda
disjoint with: Centroide
disjoint with: Malla
disjoint with: Unidad Administrativa
disjoint with: ObjetoGeografico
comment: A Surface is a 2-dimensional geometric object. A simple Surface may consists of a single patch that is associated with one exterior boundary and 0 or more interior boundaries. A single such Surface patch in 3-dimensional space is isometric to planar Surfaces, by a simple affine rotation matrix that rotates the patch onto the plane z = 0. If the patch is not vertical, the projection onto the same plane is an isomorphism, and can be represented as a linear transformation, i.e. an affine. Polyhedral Surfaces are formed by stitching together such simple Surfaces patches along their common boundaries. Such polyhedral Surfaces in a 3-dimensional space may not be planar as a whole, depending on the orientation of their planar normals. If all the patches are in alignment (their normals are parallel), then the whole stitched polyhedral surface is co-planar and can be represented as a single patch if it is connected. The boundary of a simple Surface is the set of closed Curves corresponding to its exterior and interior boundaries. A Polygon is a simple Surface that is planar. A PolyhedralSurface is a simple surface, consisting of some number of Polygon patches or facets. If a PolyhedralSurface is closed, then it bounds a solid. A MultiSurface containing a set of closed PolyhedralSurfaces can be used to represent a Solid object with holes.

Triangulated Irregular Network
type: Class
subclass of: Polyhedral Surface
disjoint with: Concept
disjoint with: ConceptScheme
disjoint with: Celda
disjoint with: Centroide
disjoint with: Malla
disjoint with: Unidad Administrativa
disjoint with: ObjetoGeografico
comment: A TIN (triangulated irregular network) is a PolyhedralSurface consisting only of Triangle patches.

Triangle
type: Class
subclass of: Polygon
disjoint with: Concept
disjoint with: ConceptScheme
disjoint with: Celda
disjoint with: Centroide
disjoint with: Malla
disjoint with: Unidad Administrativa
disjoint with: ObjetoGeografico
comment: A Triangle is a polygon with 3 distinct, non-collinear vertices and no interior boundary.

Resource
type: Class
comment: El recurso de la clase, todo. @es
comment: The class resource, everything.

Concept
type: Class
disjoint with: ConceptScheme
disjoint with: Celda
disjoint with: Centroide
disjoint with: Malla
disjoint with: Unidad Administrativa
disjoint with: ObjetoGeografico
description: A SKOS concept can be viewed as an idea or notion; a unit of thought. However, what constitutes a unit of thought is subjective, and this definition is meant to be suggestive, rather than restrictive. The notion of a SKOS concept is useful when describing the conceptual or intellectual structure of a knowledge organization system, and when referring to specific ideas or meanings established within a KOS.
comment: Un concepto SKOS puede considerarse una idea o noción, una unidad de pensamiento. Sin embargo, lo que constituye una unidad de pensamiento es subjetivo, y esta definición pretende ser sugerente, más que restrictiva. La noción de un concepto SKOS es útil para describir la estructura conceptual o intelectual de un sistema de organización del conocimiento, y para referirse a ideas o significados específicos establecidos dentro de un KOS. @es

ConceptScheme
type: Class
disjoint with: Celda
disjoint with: Centroide
disjoint with: Malla
disjoint with: Unidad Administrativa
disjoint with: ObjetoGeografico
description: A SKOS concept scheme can be viewed as an aggregation of one or more SKOS concepts. Semantic relationships (links) between those concepts may also be viewed as part of a concept scheme. This definition is, however, meant to be suggestive rather than restrictive, and there is some flexibility in the formal data model stated below. The notion of a concept scheme is useful when dealing with data from an unknown source, and when dealing with data that describes two or more different knowledge organization systems.
comment: Un esquema de conceptos SKOS puede verse como una agregación de uno o más conceptos SKOS. Las relaciones semánticas (enlaces) entre esos conceptos también pueden considerarse parte de un esquema de conceptos. Sin embargo, esta definición pretende ser sugerente y no restrictiva, y existe cierta flexibilidad en el modelo de datos formal que se expone a continuación. La noción de esquema conceptual es útil cuando se trata de datos de una fuente desconocida y cuando se trata de datos que describen dos o más sistemas de organización del conocimiento diferentes. @es

Instante
type: Class

Intervalo
type: Class

Kind
type: Class
comment: La clase padre de todos los objetos @es
comment: The parent class for all objects

Catalog
type: Class
subclass of: Dataset
subclass of: Restriction
  on property: hasPart
  all values from: Resource
comment: A curated collection of metadata about resources (e.g., datasets and data services in the context of a data catalog).

DataService
type: Class
subclass of: Service
subclass of: Resource
subclass of: Restriction
  on property: endpointURL
  max cardinality: 1
comment: A site or end-point providing operations related to the discovery of, access to, or processing functions on, data or related resources.

Dataset
type: Class
subclass of: Resource
comment: A collection of data, published or curated by a single agent, and available for access or download in one or more representations.
scope note: This class describes the conceptual dataset. One or more representations might be available, with differing schematic layouts and formats or serializations.

Distribution
type: Class
comment: A specific representation of a dataset. A dataset might be available in multiple serializations that may differ in various ways, including natural language, media-type or format, schematic organization, temporal and spatial resolution, level of detail or profiles (which might specify any or all of the above).
scope note: This represents a general availability of a dataset it implies no information about the actual access method of the data, i.e. whether by direct download, API, or through a Web page. The use of dcat:downloadURL property indicates directly downloadable distributions.

Resource
type: Class
comment: Resource published or curated by a single agent.
scope note: The class of all cataloged resources, the super-class of dcat:Dataset, dcat:DataService, dcat:Catalog and any other member of a dcat:Catalog. This class carries properties common to all cataloged resources, including datasets and data services. It is strongly recommended to use a more specific sub-class. When describing a resource which is not a dcat:Dataset or dcat:DataService, it is recommended to create a suitable sub-class of dcat:Resource, or use dcat:Resource with the dct:type property to indicate the specific type.

MarcoCapturado ErosionCarcavasYBarrancos
type: Class
subclass of: CapturedFrame

CarcavasYBarrancosCategoria
type: Class
subclass of: Categoria
subclass of: Restriction
  on property: has exact match
  all values from: CarcavasYBarrancosValor
comment: Zonas de erosión en cárcavas @es

CarcavasYBarrancosValor
type: Class
subclass of: ValorPixel
description: Valor posible del píxel para la erosión de cárcavas y barrancos @es

Categoria
type: Class
comment: Clasificación de los valores de Píxel @es

MarcoCapturado ErosionEnCauces
type: Class
subclass of: CapturedFrame

EnCaucesCategoria
type: Class
subclass of: Categoria
subclass of: Restriction
  on property: has exact match
  all values from: EnCaucesValor
comment: Riesgo de erosión en cauces por unidades hidrológicas @es

EnCaucesValor
type: Class
subclass of: ValorPixel
description: Valor posible del píxel para la erosión en cauces y regueros @es

MarcoCapturado ErosionEolica
type: Class
subclass of: CapturedFrame

EolicaCategoria
type: Class
subclass of: Categoria
subclass of: Restriction
  on property: has exact match
  all values from: EolicaValor
comment: Riesgo de erosión eólica @es

EolicaValor
type: Class
subclass of: ValorPixel
description: Valor posible del píxel para la erosión eólica @es

MarcoCapturado ErosionLaminarYRegueros
type: Class
subclass of: CapturedFrame

Niveles erosivos de erosión laminar y en regueros
type: Class
subclass of: Categoria
subclass of: Restriction
  on property: has exact match
  all values from: LaminarYReguerosValor

LaminarYReguerosValor
type: Class
subclass of: ValorPixel
description: Valor posible del píxel para la erosión laminar y en regueros @es

MarcoCapturado ErosionMovimientosEnMasa
type: Class
subclass of: CapturedFrame

MovimientosEnMasaCategoria
type: Class
subclass of: Categoria
subclass of: Restriction
  on property: has exact match
  all values from: MovimientosEnMasaValor
comment: Potencialidad de Movimientos en Masa @es

MovimientosEnMasaValor
type: Class
subclass of: ValorPixel
description: Valor posible del píxel para la erosión de movimientos en masa @es

ValorPixel
type: Class
comment: Valor del píxel

Celda
type: Class
subclass of: Feature
subclass of: ObjetoGeografico
disjoint with: Centroide
disjoint with: Malla
description: La clase representa una celda perteneciente a una malla @es
description: The class represents a cell that belongs to a grid

Centroide
type: Class
subclass of: Feature
subclass of: ObjetoGeografico
disjoint with: Malla
description: La clase representa el centroide de una celda de la malla @es
description: The class represents the centroid of a cell

Malla
type: Class
subclass of: Feature
subclass of: Entity
subclass of: ObjetoGeografico
description: La clase representa un sistema de representación espacial bidimensional (una malla) @es
description: The class represents a bidimensional system of spatial representation (a grid)

Unidad Administrativa
type: Class
subclass of: Feature
subclass of: ObjetoGeografico
subclass of: Restriction
  on property: codigoINE
  all values from: string
source: Catálogo de Objetos Geográficos BTN100. @es
comment: “La Unión Europea entiende como unidades administrativas aquellas áreas donde los Estados miembros tienen o ejercen sus derechos jurisdiccionales a efectos de administración local, regional y nacional. Están separadas mediante límites administrativos y frecuentemente están organizadas jerárquicamente, reflejando los distintos grados de responsabilidad implicados” [INSPIRE ANEXO 1.Tema 4]. Definen las áreas de cada municipio o condominio, provincia, comunidad autónoma y nación española. @es

Spatial reference system
type: NamedIndividual
type: ConceptScheme
description: System for identifying position in the real world [ISO 19112]
same as: http://inspire.ec.europa.eu/glossary/SpatialReferenceSystem:2"

Area
type: NamedIndividual
type: QUDT Concept
type: Quantity Kind
base CGS unit dimensions: L^2
base SI unit dimensions: m^2
base unit dimensions: L^2
description: Area is a quantity expressing the two-dimensional size of a defined part of a surface, typically a region bounded by a closed curve.

Meter
type: NamedIndividual
type: BaseUnit
type: QUDT Concept
type: LengthUnit
type: MKS-Unit
type: Unit
code: 1090
long description: The metric and SI base unit of distance. The 17th General Conference on Weights and Measures in 1983 defined the meter as that distance that makes the speed of light in a vacuum equal to exactly 299 792 458 meters per second. The speed of light in a vacuum, \(c\), is one of the fundamental constants of nature. The meter is equal to approximately 1.093 613 3 yards, 3.280 840 feet, or 39.370 079 inches.
unece common code: MTR
description: The metric and SI base unit of distance. The meter is equal to approximately 1.093 613 3 yards, 3.280 840 feet, or 39.370 079 inches.
id: U000E1090
ucum case insensitive code: M
ucum case sensitive code: m
ucum code: M
ucum code: m
preferred label: meter

Square Meter
type: NamedIndividual
type: AreaUnit
type: QUDT Concept
type: Derived Unit
type: Unit
code: 1705
unece common code: M2 m2
description: The S I unit of area is the square metre.
has quantity kind: Area
id: U150E1705
ucum case insensitive code: M2
ucum case sensitive code: m2
ucum code: M2
ucum code: m2
preferred label: square-meter

ActividadCapturada INES2015
type: NamedIndividual
type: Capture
type: Activity
ended at time: 2020-01-01T08:00:00Z
started at time: 2015-11-25T03:40:00Z
description: Actividad de realización del Inventario Nacional de Erosión de Suelos 2015 @es

Categoria:LaminasDeAguaSuperficialesYHumedales
type: NamedIndividual
type: Categoria
type: EolicaCategoria
type: Niveles erosivos de erosión laminar y en regueros
type: MovimientosEnMasaCategoria
has categoria: Láminas de agua superficiales y humedales
description: Láminas de agua superficiales y humedales @es

Categoria:SuperficiesArtificiales
type: NamedIndividual
type: Categoria
type: EolicaCategoria
type: Niveles erosivos de erosión laminar y en regueros
type: MovimientosEnMasaCategoria
has categoria: Superficies artificiales
description: Superficies artificiales @es

CarcavasYBarrancosCategoria:Enclave
type: NamedIndividual
type: CarcavasYBarrancosCategoria
type: Categoria
has categoria: Enclave
description: Enclaves @es

CarcavasYBarrancosCategoria:ZonaErosionCarcavas
type: NamedIndividual
type: CarcavasYBarrancosCategoria
type: Categoria
has categoria: Zona de erosión en cárcavas
description: Zonas de erosión en cárcavas @es

EnCaucesCategoria:Alto
type: NamedIndividual
type: Categoria
type: EnCaucesCategoria
has categoria: Alto
description: Riesgo alto de erosión en cauces por unidades hidrológicas @es

EnCaucesCategoria:Bajo
type: NamedIndividual
type: Categoria
type: EnCaucesCategoria
has categoria: Bajo
description: Riesgo bajo de erosión en cauces por unidades hidrológicas @es

EnCaucesCategoria:Medio
type: NamedIndividual
type: Categoria
type: EnCaucesCategoria
has categoria: Medio
description: Riesgo medio de erosión en cauces por unidades hidrológicas @es

EnCaucesCategoria:MuyAlto
type: NamedIndividual
type: Categoria
type: EnCaucesCategoria
has categoria: Muy alto
description: Riesgo muy alto de erosión en cauces por unidades hidrológicas @es

EolicaCategoria:Alto
type: NamedIndividual
type: Categoria
type: EolicaCategoria
has categoria: Alto
description: Riesgo alto de erosión eólica @es

EolicaCategoria:Bajo
type: NamedIndividual
type: Categoria
type: EolicaCategoria
has categoria: Bajo
description: Riesgo bajo de erosión eólica @es

EolicaCategoria:Medio
type: NamedIndividual
type: Categoria
type: EolicaCategoria
has categoria: Medio
description: Riesgo medio de erosión eólica @es

EolicaCategoria:MuyAlto
type: NamedIndividual
type: Categoria
type: EolicaCategoria
has categoria: Muy alto
description: Riesgo muy alto de erosión eólica @es

EolicaCategoria:MuyBajo
type: NamedIndividual
type: Categoria
type: EolicaCategoria
has categoria: Muy bajo
description: Riesgo muy bajo de erosión eólica @es

LaminarYReguerosCategoria:>100<=200
type: NamedIndividual
type: Categoria
type: Niveles erosivos de erosión laminar y en regueros
has categoria: >100 ≤200
description: Nivel erosivo >100 ≤200 de erosión laminar y en regueros @es

LaminarYReguerosCategoria:>10<=25
type: NamedIndividual
type: Categoria
type: Niveles erosivos de erosión laminar y en regueros
has categoria: >10 ≤25
description: Nivel erosivo >10 ≤25 de erosión laminar y en regueros @es

LaminarYReguerosCategoria:>200
type: NamedIndividual
type: Categoria
type: Niveles erosivos de erosión laminar y en regueros
has categoria: >200
description: Nivel erosivo >200 de erosión laminar y en regueros @es

LaminarYReguerosCategoria:>25<=50
type: NamedIndividual
type: Categoria
type: Niveles erosivos de erosión laminar y en regueros
has categoria: >25 ≤50
description: Nivel erosivo >25 ≤50 de erosión laminar y en regueros @es

LaminarYReguerosCategoria:>50<=100
type: NamedIndividual
type: Categoria
type: Niveles erosivos de erosión laminar y en regueros
has categoria: >50 ≤100
description: Nivel erosivo >50 ≤100 de erosión laminar y en regueros @es

LaminarYReguerosCategoria:>5<=10
type: NamedIndividual
type: Categoria
type: Niveles erosivos de erosión laminar y en regueros
has categoria: >5 ≤10
description: Nivel erosivo >5 ≤10 de erosión laminar y en regueros @es

LaminarYReguerosCategoria:<=5
type: NamedIndividual
type: Categoria
type: Niveles erosivos de erosión laminar y en regueros
has categoria: ≤5
description: Nivel erosivo ≤5 de erosión laminar y en regueros @es

MovimientosEnMasaCategoria:Alta
type: NamedIndividual
type: Categoria
type: MovimientosEnMasaCategoria
has categoria: Alta
description: Potencialidad alta de movimientos en masa @es

MovimientosEnMasaCategoria:BajaOModerada
type: NamedIndividual
type: Categoria
type: MovimientosEnMasaCategoria
has categoria: Baja o moderada
description: Potencialidad baja o moderada de movimientos en masa @es

MovimientosEnMasaCategoria:Media
type: NamedIndividual
type: Categoria
type: MovimientosEnMasaCategoria
has categoria: Media
description: Potencialidad media de movimientos en masa @es

MovimientosEnMasaCategoria:MuyAlta
type: NamedIndividual
type: Categoria
type: MovimientosEnMasaCategoria
has categoria: Muy alta
description: Potencialidad muy alta de movimientos en masa @es

MovimientosEnMasaCategoria:NulaOMuyBaja
type: NamedIndividual
type: Categoria
type: MovimientosEnMasaCategoria
has categoria: Nula o muy baja
description: Potencialidad nula o muy baja de movimientos en masa @es

ColeccionErosionSuelos INES
type: NamedIndividual
type: Collection
type: Entity
description: Inventario Nacional de Erosión de Suelos de España @es
description: National Inventory of Soil Erosion of Spain
comment: Colección del Inventario Nacional de Erosión de Suelos de España @es

Fecha:2015-01-01
type: NamedIndividual
type: Instante
in XSD date: 2015-01-01

Marco:INES2015
type: NamedIndividual
type: Frame
type: Entity
was member of: ColeccionErosionSuelos INES

MarcoCapturado:ErosionCarcavasYBarrancos2015
type: NamedIndividual
type: CapturedFrame
type: Frame
type: Entity
type: MarcoCapturado ErosionCarcavasYBarrancos
frappe:samplingTime: Fecha:2015-01-01
was generated by: ActividadCapturada INES2015
description: Cobertura vectorial de erosión en cauces @es

MarcoCapturado:ErosionEnCauces2015
type: NamedIndividual
type: CapturedFrame
type: Frame
type: Entity
type: MarcoCapturado ErosionEnCauces
frappe:samplingTime: Fecha:2015-01-01
was generated by: ActividadCapturada INES2015
description: Cobertura vectorial de erosión en cárcavas y barrancos @es

MarcoCapturado:ErosionEolica2015
type: NamedIndividual
type: CapturedFrame
type: Frame
type: Entity
type: MarcoCapturado ErosionEolica
frappe:samplingTime: Fecha:2015-01-01
was generated by: ActividadCapturada INES2015
description: Ráster de erosión éolica @es

MarcoCapturado:ErosionLaminarYEnRegueros2015
type: NamedIndividual
type: CapturedFrame
type: Frame
type: Entity
type: MarcoCapturado ErosionLaminarYRegueros
frappe:samplingTime: Fecha:2015-01-01
was generated by: ActividadCapturada INES2015
description: Ráster de erosión laminar y en regueros @es

MarcoCapturado:ErosionMovimientosEnMasa2015
type: NamedIndividual
type: CapturedFrame
type: Frame
type: Entity
type: MarcoCapturado ErosionMovimientosEnMasa
frappe:samplingTime: Fecha:2015-01-01
was generated by: ActividadCapturada INES2015
description: Ráster de erosión de movimientos en masa @es

ValorPixel:-9999
type: NamedIndividual
type: ValorPixel
tiene valor pixel: -9999
description: Valor del píxel igual a -9999 @es

ValorPixel:1
type: NamedIndividual
type: ValorPixel
tiene valor pixel: 1
description: Valor del píxel igual a 1 @es

ValorPixel:2
type: NamedIndividual
type: ValorPixel
tiene valor pixel: 2
description: Valor del píxel igual a 2 @es

ValorPixel:6
type: NamedIndividual
type: ValorPixel
tiene valor pixel: 3
description: Valor del píxel igual a 3 @es

ValorPixel:4
type: NamedIndividual
type: ValorPixel
tiene valor pixel: 4
description: Valor del píxel igual a 4 @es

ValorPixel:5
type: NamedIndividual
type: ValorPixel
tiene valor pixel: 5
description: Valor del píxel igual a 5 @es

ValorPixel:6
type: NamedIndividual
type: ValorPixel
tiene valor pixel: 6
description: Valor del píxel igual a 6 @es

ValorPixel:7
type: NamedIndividual
type: ValorPixel
tiene valor pixel: 7
description: Valor del píxel igual a 1 @es

ValorPixel:8
type: NamedIndividual
type: ValorPixel
tiene valor pixel: 8
description: Valor del píxel igual a 8 @es

ValorPixel:9
type: NamedIndividual
type: ValorPixel
tiene valor pixel: 9
description: Valor del píxel igual a 9 @es

axiom: celda SubClassOf asWKT some wktLiteral
type: false

axiom: cuadricula DisjointWith Geometry
type: true

axiom: cuadricula DisjointWith Geometry
type: true

axiom: cuadricula DisjointWith Geometry
type: true

axiom: cuadricula DisjointWith Geometry
type: true

axiom: celda SubClassOf asWKT some wktLiteral
type: false

axiom: celda SubClassOf asWKT some wktLiteral
type: false

axiom: celda SubClassOf asWKT some wktLiteral
type: false

max cardinality: 1

cardinality: 1

max qualified cardinality: 1

max cardinality: 1

cardinality: 1

max cardinality: 1

cardinality: 1

max cardinality: 1

max cardinality: 1

max cardinality: 1

max qualified cardinality: 1

cardinality: 1

cardinality: 1

max cardinality: 1

relation
description: Recommended best practice is to identify the related resource by means of a string conforming to a formal identification system.

quantity
description: a property to relate an observable thing with a quantity (qud:Quantity)