Spatial grid ontology
type: Ontology
version IRI: https://datos.iepnb.es/def/sector-publico/territorio/malla-espacial/1.0
creator: Tragsatec @es
description: Esta ontología describe un sistema de mallas geográficas. @es
description: This ontology specifies a geographical grid system available for the provision of spatial information for multipurposes uses.
title: Ontología de malla espacial @es
Preferred Namespace Prefix: malla-espacial
version info: 0.1

Preferred Namespace Prefix
type: AnnotationProperty
comment: The preferred namespace prefix to use when using terms from this vocabulary in an XML document.

Preferred Namespace Uri
type: AnnotationProperty
comment: The preferred namespace URI to use when using terms from this vocabulary in an XML document.

Well-known Text Literal
type: Datatype

quantity
type: ObjectProperty
description: a property to relate an observable thing with a quantity (qud:Quantity)

has quantity
type: ObjectProperty
range: Quantity
description: a property to relate an observable thing with a quantity (qud:Quantity)

unit
type: ObjectProperty
range: Unit
description: A reference to the unit of measure of a quantity (variable or constant) of interest.

pertenece a la autonomía
type: ObjectProperty
sub property of: within
issued: 2014-03-28
comment: Autonomía (Comunidad Autónoma o Ciudad Autónoma) a la que pertenece un fenómeno geográfico o una entidad administrativa @es

es capital de
type: ObjectProperty
sub property of: within
issued: 2018-01-08
comment: Especifica una unidad territorial de la que esta unidad territorial es capital @es

isla
type: ObjectProperty
sub property of: within
issued: 2014-05-03
comment: Isla a la que pertenece un fenómeno geográfico o una entidad administrativa @es

pertenece al municipio
type: ObjectProperty
sub property of: within
range: Municipio
issued: 2014-03-28
comment: Municipio al que pertenece un fenómeno geográfico o una entidad administrativa @es

pertenece al país
type: ObjectProperty
sub property of: within
range: País
issued: 2014-03-28
comment: País al que pertenece un fenómeno geográfico o una entidad administrativa @es

pertenece a provincia
type: ObjectProperty
sub property of: within
range: Provincia
issued: 2014-04-15
comment: Provincia a la que pertenece un fenómeno geográfico o una entidad administrativa @es

hasGeometry
type: ObjectProperty
inverse of: isGeometryOf
domain: Feature
range: Geometry
creator: OGC GeoSPARQL 1.0 Standard Working Group
description: A spatial representation for a given feature.

contains
type: ObjectProperty
domain: SpatialObject
range: SpatialObject
creator: OGC GeoSPARQL 1.0 Standard Working Group
description: Existe si el sujeto SpatialObject contiene espacialmente el objeto SpatialObject. @es
description: Exists if the subject SpatialObject spatially contains the object SpatialObject. DE-9IM: T*****FF*

within
type: ObjectProperty
domain: SpatialObject
range: SpatialObject
creator: OGC GeoSPARQL 1.0 Standard Working Group
description: Existe si el sujeto SpatialObject está espacialmente dentro del objeto SpatialObject. @es
description: Exists if the subject SpatialObject is spatially within the object SpatialObject. DE-9IM: T*F**F***

hasTopConcept
type: ObjectProperty
inverse of: topConceptOf
domain: ConceptScheme
range: Concept
description: Relates, by convention, a concept scheme to a concept which is topmost in the broader/narrower concept hierarchies for that scheme, providing an entry point to these hierarchies.

centroid of
type: ObjectProperty
sub property of: within
inverse of: hasCentroid
domain: Centroid
range: SpatialObject
label: centroide de @es

average elevation
type: ObjectProperty
sub property of: has quantity
domain: Cell
range: Quantity
description: Elevación media de la celda @es
description: average elevation of the Cell
label: elevación media @es

isGeometryOf
type: ObjectProperty
domain: Geometry
range: ObjetoGeografico
label: esGeometriaDe @es

gridOf
type: ObjectProperty
sub property of: contains
inverse of: belongs to Grid
domain: Grid
range: Cell
label: mallaDe @es

belongs to Cell
type: ObjectProperty
sub property of: within
domain: SpatialObject
range: Cell
label: pertenece a Celda @es

belongs to Grid
type: ObjectProperty
sub property of: within
domain: Cell
range: Grid
label: pertenece a Malla @es

Spatial Reference System
type: ObjectProperty
type: FunctionalProperty
domain: Geometry
range: Concept
label: Sistema Referencia Espacial @es

surface
type: ObjectProperty
sub property of: has quantity
range: Quantity
description: surface of the Cell
label: superficie @es

hasQuantity
type: ObjectProperty
range: Quantity
label: tieneCantidad @es

hasCell
type: ObjectProperty
sub property of: contains
domain: SpatialObject
range: Cell
label: tieneCelda @es

hasCentroid
type: ObjectProperty
sub property of: contains
domain: SpatialObject
range: Centroid
label: tieneCentroide @es

belongs to Administrative Division
type: ObjectProperty
sub property of: within
domain: Cell
range: Unidad Administrativa
label: pertenece a unidad administrativa @es

conversion coefficient
type: DatatypeProperty
range: double

height
type: DatatypeProperty
range: string

latex symbol
type: DatatypeProperty
sub property of: literal
range: string
description: The symbol is a glyph that is used to represent some concept, typically a unit or a quantity, in a compact form. For example, the symbol for an Ohm is $\ohm$. This contrasts with 'unit:abbreviation', which gives a short alphanumeric abbreviation for the unit, 'ohm' for Ohm.

literal
type: DatatypeProperty
sub property of: literal
range: string

symbol token
type: DatatypeProperty
sub property of: literal
range: token
description: A token represents tokenized strings. The value space of token is the set of strings that do not contain the carriage return (#xD), line feed (#xA) nor tab (#x9) characters, that have no leading or trailing spaces (#x20) and that have no internal sequences of two or more spaces. The lexical space· of token is the set of strings that do not contain the carriage return (#xD), line feed (#xA) nor tab (#x9) characters, that have no leading or trailing spaces (#x20) and that have no internal sequences of two or more spaces. The base type of token is normalizedString.
was quoted from: token

width
type: DatatypeProperty
range: string

código de país ISO
type: DatatypeProperty
range: string
comment: Un código de país de dos letras, de la lista ISO 3166 @es

literal
type: DatatypeProperty
range: string
comment: A general purpose property for holding string literals.

asGML
type: DatatypeProperty
sub property of: has serialization
domain: Geometry
range: gmlLiteral
contributor: Matthew Perry
creator: OGC GeoSPARQL 1.0 Standard Working Group
date: 2011-06-16
description: The GML serialization of a geometry

asWKT
type: DatatypeProperty
sub property of: has serialization
domain: Geometry
range: Well-known Text Literal
contributor: Matthew Perry
creator: OGC GeoSPARQL 1.0 Standard Working Group
date: 2011-06-16
description: The WKT serialization of a geometry

has serialization
type: DatatypeProperty
domain: Geometry
range: Literal
contributor: Matthew Perry
creator: OGC GeoSPARQL 1.0 Standard Working Group
date: 2011-06-16
description: Connects a geometry object with its text-based serialization.

code
type: DatatypeProperty
domain: Cell
range: string
description: El código que identifica la celda en la malla a la que pertenece. @es
description: The code that identifies the cell in the grid.
label: código @es

column
type: DatatypeProperty
domain: Cell
range: integer
description: El número que identifica la columna de la celda en la malla a la que pertenece. Este número permitirá obtener las celdas adyacentes en el eje horizontal. @es
description: The number that identifies the column the cell belongs to in the grid. It will allow to obtain the adjacent cells in the horizontal axis.
label: columna @es

row
type: DatatypeProperty
domain: Cell
range: integer
description: El número que identifica la fila de la celda en la malla a la que pertenece. Este número permitirá obtener las celdas adyacentes en el eje vertical. @es
description: The number that identifies the row the cell belongs to in the grid. It will allow to obtain the adjacent cells in the vertical axis.
label: fila @es

QUDT Concept
type: Class
subclass of: Restriction
  on property: url
  min cardinality: 0
subclass of: Restriction
  on property: longDescription
  max cardinality: 1
subclass of: Restriction
  on property: title
  max cardinality: 1
description: The root class for all QUDT concepts.

Derived Unit
type: Class
subclass of: Unit
description: A DerivedUnit is a type specification for units that are derived from other units.
deprecated: true

Quantity
type: Class
subclass of: QUDT Concept
subclass of: Restriction
  on property: hasQuantityKind
  all values from: Quantity Kind
subclass of: Restriction
  on property: quantityValue
  all values from: Quantity value
subclass of: Restriction
  on property: quantityValue
  min cardinality: 1
subclass of: Restriction
  on property: baseUnitDimensions
  max cardinality: 1
subclass of: Restriction
  on property: mathMLdefinition
  max cardinality: 1
description: A quantity is the measurement of an observable property of a particular object, event, or physical system. A quantity is always associated with the context of measurement (i.e. the thing measured, the measured value, the accuracy of measurement, etc.) whereas the underlying quantity kind is independent of any particular measurement. Thus, length is a quantity kind while the height of a rocket is a specific quantity of length; its magnitude that may be expressed in meters, feet, inches, etc. Examples of physical quantities include physical constants, such as the speed of light in a vacuum, Planck's constant, the electric permittivity of free space, and the fine structure constant. In other words, quantities are quantifiable aspects of the world, such as time, distance, velocity, mass, momentum, energy, and weight, and units are used to describe their measure. Many of which are related to each other by various physical laws, and as a result the units of some of the quantities can be expressed as products (or ratios) of powers of other units (e.g., momentum is mass times velocity and velocity is measured in distance divided by time). These relationships are discussed in dimensional analysis. Those that cannot be so expressed can be regarded as "fundamental" in this sense. A quantity is distinguished from a "quantity kind" in that the former carries a value and the latter is a type specifier.

Quantity Kind
type: Class
subclass of: QUDT Concept
subclass of: Restriction
  on property: broader
  all values from: Quantity Kind
subclass of: Restriction
  on property: baseCGSUnitDimensions
  max cardinality: 1
subclass of: Restriction
  on property: baseISOUnitDimensions
  max cardinality: 1
subclass of: Restriction
  on property: baseImperialUnitDimensions
  max cardinality: 1
subclass of: Restriction
  on property: baseSIUnitDimensions
  max cardinality: 1
subclass of: Restriction
  on property: baseUSCustomaryUnitDimensions
  max cardinality: 1
subclass of: Restriction
  on property: baseUnitDimensions
  max cardinality: 4
subclass of: Restriction
  on property: latex symbol
  max cardinality: 1
subclass of: Restriction
  on property: mathMLdefinition
  max cardinality: 1
subclass of: Restriction
  on property: symbol token
  max cardinality: 1
description: A Quantity Kind is any observable property that can be measured and quantified numerically. Familiar examples include physical properties such as length, mass, time, force, energy, power, electric charge, etc. Less familiar examples include currency, interest rate, price to earning ratio, and information capacity.

Quantity value
type: Class
subclass of: QUDT Concept
subclass of: Restriction
  on property: hasQuantityKind
  all values from: Quantity Kind
subclass of: Restriction
  on property: relativeStandardUncertainty
  all values from: double
subclass of: Restriction
  on property: standardUncertainty
  all values from: double
subclass of: Restriction
  on property: relativeStandardUncertainty
  max cardinality: 1
subclass of: Restriction
  on property: standardUncertainty
  max cardinality: 1
description: A Quantity Value expresses the magnitude and kind of a quantity and is given by the product of a numerical value n and a unit of measure U. The number multiplying the unit is referred to as the numerical value of the quantity expressed in that unit. Refer to NIST SP 811 section 7 for more on quantity values.

Unit
type: Class
subclass of: QUDT Concept
subclass of: Restriction
  on property: hasQuantityKind
  all values from: Quantity Kind
subclass of: Restriction
  on property: baseISOUnitDimensions
  max cardinality: 1
subclass of: Restriction
  on property: baseImperialUnitDimensions
  max cardinality: 1
subclass of: Restriction
  on property: baseSIUnitDimensions
  max cardinality: 1
subclass of: Restriction
  on property: baseUSCustomaryUnitDimensions
  max cardinality: 1
subclass of: Restriction
  on property: baseUnitDimensions
  max cardinality: 4
subclass of: Restriction
  on property: latex symbol
  max cardinality: 1
subclass of: Restriction
  on property: mathMLdefinition
  max cardinality: 1
subclass of: Restriction
  on property: siUnitsExpression
  max cardinality: 1
subclass of: Restriction
  on property: symbol token
  max cardinality: 1
subclass of: Restriction
  on property: uneceCommonCode
  max cardinality: 1
description: A unit of measure, or unit, is a particular quantity value that has been chosen as a scale for measuring other quantities the same kind (more generally of equivalent dimension). For example, the meter is a quantity of length that has been rigorously defined and standardized by the BIPM (International Board of Weights and Measures). Any measurement of the length can be expressed as a number multiplied by the unit meter. More formally, the value of a physical quantity Q with respect to a unit (U) is expressed as the scalar multiple of a real number (n) and U, as \(Q = nU\).

Ciudad Autónoma
type: Class
subclass of: Unidad Administrativa

Comunidad Autónoma
type: Class
subclass of: Unidad Administrativa

Comunidad Jurisdiccional
type: Class
subclass of: Unidad Administrativa

Municipio
type: Class
subclass of: Unidad Administrativa

País
type: Class
subclass of: Unidad Administrativa

Provincia
type: Class
subclass of: Unidad Administrativa

Feature
type: Class
equivalent class: ObjetoGeografico
subclass of: SpatialObject
disjoint with: Geometry
contributor: Matthew Perry
creator: OGC GeoSPARQL 1.0 Standard Working Group
date: 2011-06-16
description: This class represents the top-level feature type. This class is equivalent to GFI_Feature defined in ISO 19156:2011, and it is superclass of all feature types.
description: Esta clase representa el tipo de entidad de nivel superior. Esta clase es equivalente a GFI_Feature definido en ISO 19156: 2011, y es Superclase de todos los tipos Feature. @es

Geometry
type: Class
subclass of: SpatialObject
contributor: Matthew Perry
creator: OGC GeoSPARQL 1.0 Standard Working Group
date: 2011-06-16
description: The class represents the top-level geometry type. This class is equivalent to the UML class GM_Object defined in ISO 19107, and it is superclass of all geometry types.

SpatialObject
type: Class
contributor: Matthew Perry
creator: OGC GeoSPARQL 1.0 Standard Working Group
date: 2011-06-16
description: The class spatial-object represents everything that can have a spatial representation. It is superclass of feature and geometry.

Curve
type: Class
subclass of: Geometry
comment: A Curve is a 1-dimensional geometric object usually stored as a sequence of Points, with the subtype of Curve specifying the form of the interpolation between Points. This specification defines only one subclass of Curve, LineString, which uses linear interpolation between Points. A Curve is a 1-dimensional geometric object that is the homeomorphic image of a real, closed, interval. A Curve is simple if it does not pass through the same Point twice with the possible exception of the two end points. A Curve is closed if its start Point is equal to its end Point. The boundary of a closed Curve is empty. A Curve that is simple and closed is a Ring. The boundary of a non-closed Curve consists of its two end Points. A Curve is defined as topologically closed, that is, it contains its endpoints f(a) and f(b).

Geometry
type: Class
subclass of: Geometry
description: The class represents the top-level geometry type. This class is equivalent to the UML class GM_Object defined in ISO 19107, and it is superclass of all geometry types.
comment: Geometry is the root class of the hierarchy. The instantiable subclasses of Geometry are restricted to 0, 1 and 2-dimensional geometric objects that exist in 2, 3 or 4-dimensional coordinate space (R2, R3 or R4). Geometry values in R2 have points with coordinate values for x and y. Geometry values in R3 have points with coordinate values for x, y and z or for x, y and m. Geometry values in R4 have points with coordinate values for x, y, z and m. The interpretation of the coordinates is subject to the coordinate reference systems associated to the point. All coordinates within a geometry object should be in the same coordinate reference systems. Each coordinate shall be unambiguously associated to a coordinate reference system either directly or through its containing geometry. The z coordinate of a point is typically, but not necessarily, represents altitude or elevation. The m coordinate represents a measurement. All Geometry classes described in this specification are defined so that instances of Geometry are topologically closed, i.e. all represented geometries include their boundary as point sets. This does not affect their representation, and open version of the same classes may be used in other circumstances, such as topological representations.

Geometry Collection
type: Class
subclass of: Geometry
comment: A GeometryCollection is a geometric object that is a collection of some number of geometric objects. All the elements in a GeometryCollection shall be in the same Spatial Reference System. This is also the Spatial Reference System for the GeometryCollection. GeometryCollection places no other constraints on its elements. Subclasses of GeometryCollection may restrict membership based on dimension and may also place other constraints on the degree of spatial overlap between elements.

Line
type: Class
subclass of: Line String
comment: A Line is a LineString with exactly 2 Points.

Line String
type: Class
subclass of: Curve
comment: A LineString is a Curve with linear interpolation between Points. Each consecutive pair of Points defines a Line segment.

Linear Ring
type: Class
subclass of: Line String
comment: A LinearRing is a LineString that is both closed and simple.

Multi Curve
type: Class
subclass of: Geometry Collection
comment: A MultiCurve is a 1-dimensional GeometryCollection whose elements are Curves. A MultiCurve defines a set of methods for its subclasses and is included for reasons of extensibility. A MultiCurve is simple if and only if all of its elements are simple and the only intersections between any two elements occur at Points that are on the boundaries of both elements. The boundary of a MultiCurve is obtained by applying the mod 2 union rule: A Point is in the boundary of a MultiCurve if it is in the boundaries of an odd number of elements of the MultiCurve. A MultiCurve is closed if all of its elements are closed. The boundary of a closed MultiCurve is always empty. A MultiCurve is defined as topologically closed.

Multi Line String
type: Class
subclass of: Multi Curve
comment: A MultiLineString is a MultiCurve whose elements are LineStrings.

Multi Point
type: Class
subclass of: Geometry Collection
comment: A MultiPoint is a 0-dimensional GeometryCollection. The elements of a MultiPoint are restricted to Points. ThePoints are not connected or ordered in any semantically important way. A MultiPoint is simple if no two Points in the MultiPoint are equal (have identical coordinate values in X and Y). Every MultiPoint is spatially equal to a simple Multipoint. The boundary of a MultiPoint is the empty set.

Multi Polygon
type: Class
subclass of: Multi Surface
comment: A MultiPolygon is a MultiSurface whose elements are Polygons. The assertions for MultiPolygons are as follows. a) The interiors of 2 Polygons that are elements of a MultiPolygon may not intersect. b) The boundaries of any 2 Polygons that are elements of a MultiPolygon may not cross and may touch at only a finite number of Points. c) A MultiPolygon is defined as topologically closed. d) A MultiPolygon may not have cut lines, spikes or punctures, a MultiPolygon is a regular closed Point set, e) The interior of a MultiPolygon with more than 1 Polygon is not connected; the number of connected components of the interior of a MultiPolygon is equal to the number of Polygons in the MultiPolygon. The boundary of a MultiPolygon is a set of closed Curves (LineStrings) corresponding to the boundaries of its element Polygons. Each Curve in the boundary of the MultiPolygon is in the boundary of exactly 1 element Polygon, and every Curve in the boundary of an element Polygon is in the boundary of the MultiPolygon.

Multi Surface
type: Class
subclass of: Geometry Collection
comment: A MultiSurface is a 2-dimensional GeometryCollection whose elements are Surfaces, all using coordinates from the same coordinate reference system. The geometric interiors of any two Surfaces in a MultiSurface may not intersect in the full coordinate system. The boundaries of any two coplanar elements in a MultiSurface may intersect, at most, at a finite number of Points. If they were to meet along a curve, they could be merged into a single surface. A MultiSurface may be used to represent heterogeneous surfaces collections of polygons and polyhedral surfaces. It defines a set of methods for its subclasses. The subclass of MultiSurface is MultiPolygon corresponding to a collection of Polygons only. Other collections shall use MultiSurface.

Point
type: Class
subclass of: Geometry
comment: A Point is a 0-dimensional geometric object and represents a single location in coordinate space. A Point has an x-coordinate value, a y-coordinate value. If called for by the associated Spatial Reference System, it may also have coordinate values for z and m. The boundary of a Point is the empty set.

Polygon
type: Class
subclass of: Surface
comment: A Polygon is a planar Surface defined by 1 exterior boundary and 0 or more interior boundaries. Each interior boundary defines a hole in the Polygon. The exterior boundary LinearRing defines the top of the surface which is the side of the surface from which the exterior boundary appears to traverse the boundary in a counter clockwise direction. The interior LinearRings will have the opposite orientation, and appear as clockwise when viewed from the top, The assertions for Polygons (the rules that define valid Polygons) are as follows: a) Polygons are topologically closed; b) The boundary of a Polygon consists of a set of LinearRings that make up its exterior and interior boundaries; c) No two Rings in the boundary cross and the Rings in the boundary of a Polygon may intersect at a Point but only as a tangent. d) A Polygon may not have cut lines, spikes or punctures. e) The interior of every Polygon is a connected point set; f) The exterior of a Polygon with 1 or more holes is not connected. Each hole defines a connected component of the exterior.

Polyhedral Surface
type: Class
subclass of: Surface
comment: A PolyhedralSurface is a contiguous collection of polygons, which share common boundary segments. For each pair of polygons that touch, the common boundary shall be expressible as a finite collection of LineStrings. Each such LineString shall be part of the boundary of at most 2 Polygon patches. For any two polygons that share a common boundary, the top of the polygon shall be consistent. This means that when two LinearRings from these two Polygons traverse the common boundary segment, they do so in opposite directions. Since the Polyhedral surface is contiguous, all polygons will be thus consistently oriented. This means that a non-oriented surface (such as Mbius band) shall not have single surface representations. They may be represented by a MultiSurface. If each such LineString is the boundary of exactly 2 Polygon patches, then the PolyhedralSurface is a simple, closed polyhedron and is topologically isomorphic to the surface of a sphere. By the Jordan Surface Theorem (Jordans Theorem for 2-spheres), such polyhedrons enclose a solid topologically isomorphic to the interior of a sphere; the ball. In this case, the top of the surface will either point inward or outward of the enclosed finite solid. If outward, the surface is the exterior boundary of the enclosed surface. If inward, the surface is the interior of the infinite complement of the enclosed solid. A Ball with some number of voids (holes) inside can thus be presented as one exterior boundary shell, and some number in interior boundary shells.

Surface
type: Class
subclass of: Geometry
comment: A Surface is a 2-dimensional geometric object. A simple Surface may consists of a single patch that is associated with one exterior boundary and 0 or more interior boundaries. A single such Surface patch in 3-dimensional space is isometric to planar Surfaces, by a simple affine rotation matrix that rotates the patch onto the plane z = 0. If the patch is not vertical, the projection onto the same plane is an isomorphism, and can be represented as a linear transformation, i.e. an affine. Polyhedral Surfaces are formed by stitching together such simple Surfaces patches along their common boundaries. Such polyhedral Surfaces in a 3-dimensional space may not be planar as a whole, depending on the orientation of their planar normals. If all the patches are in alignment (their normals are parallel), then the whole stitched polyhedral surface is co-planar and can be represented as a single patch if it is connected. The boundary of a simple Surface is the set of closed Curves corresponding to its exterior and interior boundaries. A Polygon is a simple Surface that is planar. A PolyhedralSurface is a simple surface, consisting of some number of Polygon patches or facets. If a PolyhedralSurface is closed, then it bounds a solid. A MultiSurface containing a set of closed PolyhedralSurfaces can be used to represent a Solid object with holes.

Triangulated Irregular Network
type: Class
subclass of: Polyhedral Surface
comment: A TIN (triangulated irregular network) is a PolyhedralSurface consisting only of Triangle patches.

Triangle
type: Class
subclass of: Polygon
comment: A Triangle is a polygon with 3 distinct, non-collinear vertices and no interior boundary.

Concept
type: Class
description: A SKOS concept can be viewed as an idea or notion; a unit of thought. However, what constitutes a unit of thought is subjective, and this definition is meant to be suggestive, rather than restrictive. The notion of a SKOS concept is useful when describing the conceptual or intellectual structure of a knowledge organization system, and when referring to specific ideas or meanings established within a KOS.

ConceptScheme
type: Class
description: A SKOS concept scheme can be viewed as an aggregation of one or more SKOS concepts. Semantic relationships (links) between those concepts may also be viewed as part of a concept scheme. This definition is, however, meant to be suggestive rather than restrictive, and there is some flexibility in the formal data model stated below. The notion of a concept scheme is useful when dealing with data from an unknown source, and when dealing with data that describes two or more different knowledge organization systems.

Cell
type: Class
subclass of: ObjetoGeografico
description: La clase representa una celda perteneciente a una malla @es
description: The class represents a cell that belongs to a grid
label: Celda @es

Centroid
type: Class
subclass of: ObjetoGeografico
description: La clase representa el centroide de una celda de la malla @es
description: The class represents the centroid of a cell
label: Centroide @es

Grid
type: Class
subclass of: ObjetoGeografico
description: La clase representa un sistema de representación espacial bidimensional (una malla) @es
description: The class represents a bidimensional system of spatial representation (a grid)
label: Malla @es

Unidad Administrativa
type: Class
subclass of: ObjetoGeografico
subclass of: Restriction
  on property: title
  all values from: string
subclass of: Restriction
  on property: codigoINE
  all values from: string
source: Catálogo de Objetos Geográficos BTN100. @es
comment: “La Unión Europea entiende como unidades administrativas aquellas áreas donde los Estados miembros tienen o ejercen sus derechos jurisdiccionales a efectos de administración local, regional y nacional. Están separadas mediante límites administrativos y frecuentemente están organizadas jerárquicamente, reflejando los distintos grados de responsabilidad implicados” [INSPIRE ANEXO 1.Tema 4]. Definen las áreas de cada municipio o condominio, provincia, comunidad autónoma y nación española. @es

Spatial reference system
type: NamedIndividual
type: ConceptScheme
description: System for identifying position in the real world [ISO 19112]
same as: http://inspire.ec.europa.eu/glossary/SpatialReferenceSystem:2"

EPSG-0
type: NamedIndividual
type: ConceptScheme

ETRS89 / UTM zone 28N
type: NamedIndividual
type: Standard
type: Concept
type: Spatial reference system
in scheme: EPSG-0

ETRS89 / UTM zone 30N
type: NamedIndividual
type: Standard
type: Concept
type: Spatial reference system
in scheme: EPSG-0

Malla-1-KM
type: NamedIndividual
type: Grid
surface: Quantity:10x10km
description: Generada para península y Baleares en ETRS89 y huso 30 extendido. Se construye cuadrando las esquinas de las cuadriculas en coordenadas enteras y múltiplos de 1.000 metros. En cuanto a la identificación, se crea un identificador único que combina la coordenada x(columna) e Y(fila) de la esquina inferior izquierda de la cuadricula (esquina SW). Así por ejemplo en el píxel N0002-4798, que aparece en azul en la imagen, la coordenada de la Y es 4.798.000 y la de la X es -2.000 y está dentro de la cuadrícula de 10 km N001-479. Al trabajar en huso 30 extendido en X tendremos coordenadas negativas, cuando la coordenada es negativa el identificador será Nxxxx y cuando es positiva, Pxxxx. La malla de 1 km tiene como atributo, además de su identificador, el identificador de la cuadricula de 10 km. @es

Malla-10-KM
type: NamedIndividual
type: Grid
surface: Quantity:10x10km
description: Generada para península y Baleares en ETRS89 y huso 30 extendido. Se construye cuadrando las esquinas de las cuadriculas en coordenadas enteras y múltiplos de 10.000 metros. En cuanto a la identificación, se crea un identificador único que combina la coordenada X (columna) e Y (fila) de la esquina inferior izquierda de la cuadricula (esquina SW), ambas coordenadas divididas por 10.000. Así por ejemplo en el píxel P002-480, que aparece en azul en la imagen, la coordenada de la Y es 4.800.000 y la de la X es 20.000. Al trabajar en huso 30 extendido en X tendremos coordenadas negativas, cuando la coordenada es negativa el identificador será Nxxx y cuando es positiva, Pxxx. @es

Quantity:1x1km
type: NamedIndividual
type: Quantity
quantity value: QuantiyValue:1km2

Quantity:10x10km
type: NamedIndividual
type: Quantity
quantity value: QuantityValue:10km2

Quantity: 25x25m
type: NamedIndividual
type: Quantity
quantity value: QuantityValue: 25m2

QuantiyValue:1km2
type: NamedIndividual
type: Quantity value
height: 1000
numeric value: 1000000
width: 1000

QuantityValue:10km2
type: NamedIndividual
type: Quantity value
height: 10000
numeric value: 10000000
width: 10000

QuantityValue: 25m2
type: NamedIndividual
type: Quantity value
height: 25
numeric value: 25
width: 25

axiom: celda SubClassOf asWKT some wktLiteral
type: false

axiom: celda SubClassOf asWKT some wktLiteral
type: false

axiom: celda SubClassOf asWKT some wktLiteral
type: false

axiom: celda SubClassOf asWKT some wktLiteral
type: false

axiom: cuadricula DisjointWith Geometry
type: true

axiom: cuadricula DisjointWith Geometry
type: true

axiom: cuadricula DisjointWith Geometry
type: true

axiom: cuadricula DisjointWith Geometry
type: true

max cardinality: 1

max cardinality: 1

max qualified cardinality: 1

cardinality: 1

cardinality: 1

max cardinality: 1

max cardinality: 1

cardinality: 1

max cardinality: 1

max cardinality: 1

max cardinality: 1

max qualified cardinality: 1

cardinality: 1

cardinality: 1