Pasto grueso
type: Class
comment: Pasto grueso, denso, seco y alto ( > 1m). Puede haber algunas plantas leñosas dispersas. Los campos de cereales son representativos de este modelo.
subclass of: Pastos