Matorral Joven
type: Class
comment: Matorral o plantación joven muy densa; de más de 2m. de altura; con ramas muertas en su interior. Propagación del fuego por las copas de las plantas.
subclass of: Matorral