Forma 2
type: Class
comment: Árboles que cumplan las cuatro condiciones siguientes: ser fusiformes, tener troncos maderables de 4 o más metros, ramificarse por la parte superior y no pertenecer a la forma 1.
subclass of: FormaCubicacion