Forma 5
type: Class
comment: Árboles cuyo tronco principal es tortuoso, está dañado o es muy ramoso, por lo que no admite la clasificación en formas 1, 2 o 3. También pies de altura de fuste menor de 4 m si son de especies diferentes a las de los códigos 4 y 6.
subclass of: FormaCubicacion