Forma 6
type: Class
comment: Árboles descabezados o trasmochos a los que se les ha cortado la parte superior del tronco y las ramas en puntos próximos a su inserción en el tronco y que pertenezcan a algunas de las siguientes especies: 41, 42, 43, 55, 56, 71, 72 y 94.
subclass of: FormaCubicacion