Matorral disperso inflamable
type: Class
comment: Parecido al modelo 5, pero con especies más inflamables, de mayor talla, pudiéndose encontrar ramas gruesas en el suelo. Propagación del fuego con vientos moderados a fuertes.
subclass of: Matorral